Cyclopentane, 2-propenyl-
- Formula: C8H14
- Molecular weight: 110.1968
- IUPAC Standard InChIKey: NHIDGVQVYHCGEK-UHFFFAOYSA-N
- CAS Registry Number: 3524-75-2
- Chemical structure:
View 3d structure (requires JavaScript / HTML 5) - Other names: Cyclopentane, allyl-; Allyl cyclopentane; 1-Propene, 3-cyclopentyl-; (2-Propenyl)cyclopentane; 3-Cyclopentylpropene; 3-Cyclopentyl-1-propene

Condensed phase thermochemistry data

Data compiled as indicated in comments:
ALS - Hussein Y. Afeefy, Joel F. Liebman, and Stephen E. Stein
DH - Eugene S. Domalski and Elizabeth D. Hearing
Quantity | Value | Units | Method | Reference | Comment |
---|---|---|---|---|---|
ΔfH°liquid | -66.0 ± 1.0 | kJ/mol | Ccb | Labbauf and Rossini, 1961 | ALS |
Quantity | Value | Units | Method | Reference | Comment |
ΔcH°liquid | -5083.02 ± 0.96 | kJ/mol | Ccb | Labbauf and Rossini, 1961 | Corresponding ΔfHºliquid = -65.86 kJ/mol (simple calculation by NIST; no Washburn corrections); ALS |
Constant pressure heat capacity of liquid
Cp,liquid (J/mol*K) | Temperature (K) | Reference | Comment |
---|---|---|---|
202.9 | 298.15 | Fuchs and Peacock, 1979 | DH |

Phase change data

Data compiled as indicated in comments:
TRC - Thermodynamics Research Center, NIST Boulder Laboratories, Chris Muzny director
BS - Robert L. Brown and Stephen E. Stein
ALS - Hussein Y. Afeefy, Joel F. Liebman, and Stephen E. Stein
AC - William E. Acree, Jr., James S. Chickos
Quantity | Value | Units | Method | Reference | Comment |
---|---|---|---|---|---|
Tboil | 400.07 | K | N/A | Anonymous, 1954 | Uncertainty assigned by TRC = 0.2 K; TRC |
Quantity | Value | Units | Method | Reference | Comment |
Tfus | 162.450 | K | N/A | Streiff, Schultz, et al., 1957 | Uncertainty assigned by TRC = 0.06 K; TRC |
Tfus | 162.460 | K | N/A | Streiff, Schultz, et al., 1957 | Uncertainty assigned by TRC = 0.04 K; TRC |
Tfus | 162.480 | K | N/A | Streiff, Schultz, et al., 1957 | Uncertainty assigned by TRC = 0.02 K; TRC |
Tfus | 162.56 | K | N/A | Anonymous, 1954 | Uncertainty assigned by TRC = 0.15 K; TRC |
Tfus | 162.65 | K | N/A | Anonymous, 1954 | Uncertainty assigned by TRC = 0.1 K; TRC |
Quantity | Value | Units | Method | Reference | Comment |
ΔvapH° | 40.4 ± 0.3 | kJ/mol | C | Fuchs and Peacock, 1979 | ALS |
ΔvapH° | 40.4 ± 0.2 | kJ/mol | GCC | Fuchs and Peacock, 1979 | AC |
Reduced pressure boiling point
Tboil (K) | Pressure (bar) | Reference | Comment |
---|---|---|---|
399.2 | 1.00 | Aldrich Chemical Company Inc., 1990 | BS |

Reaction thermochemistry data

Data compiled by: Hussein Y. Afeefy, Joel F. Liebman, and Stephen E. Stein
Individual Reactions
By formula: H2 + C8H14 = C8H16
Quantity | Value | Units | Method | Reference | Comment |
---|---|---|---|---|---|
ΔrH° | -129. ± 2. | kJ/mol | Chyd | Rogers and McLafferty, 1971 | liquid phase; solvent: Hydrocarbon |

Kovats' RI, non-polar column, isothermal

Column type | Active phase | Temperature (C) | I | Reference | Comment |
---|---|---|---|---|---|
Capillary | OV-1 | 100. | 828.8 | Anders, Anders, et al., 1985 | 55. m/0.21 mm/0.35 μm, N2 |

References

Labbauf and Rossini, 1961
Labbauf, A.; Rossini, F.D.,
Heats of combustion, formation, and hydrogenation of 14 selected cyclomonoolefin hydrocarbons,
J. Phys. Chem., 1961, 65, 476-480. [all data]
Fuchs and Peacock, 1979
Fuchs, R.; Peacock, L.A.,
Heats of vaporization and gaseous heats of formation of some five- and six-membered ring alkenes,
Can. J. Chem., 1979, 57, 2302-2304. [all data]
Anonymous, 1954
Anonymous, R.,
, Am. Pet. Inst. Res. Proj. 45, Tech. Rep. 13, Ohio State Univ., 1954. [all data]
Streiff, Schultz, et al., 1957
Streiff, A.J.; Schultz, L.H.; Hulme, A.R.; Tucker, J.A.; Krouskop, N.C.; Rossini, F.D.,
Purification, Purity, and Freezing Points of 20 API Standard API Research Hydrocarbons,
Anal. Chem., 1957, 29, 361. [all data]
Aldrich Chemical Company Inc., 1990
Aldrich Chemical Company Inc.,
Catalog Handbook of Fine Chemicals, Aldrich Chemical Company, Inc., Milwaukee WI, 1990, 1. [all data]
Rogers and McLafferty, 1971
Rogers, D.W.; McLafferty, F.J.,
A new hydrogen calorimeter. Heats of hydrogenation of allyl and vinyl unsaturation adjacent to a ring,
Tetrahedron, 1971, 27, 3765-3775. [all data]