9-Dodecenol, trans
- Formula: C12H24O
- Molecular weight: 184.3184
- IUPAC Standard InChIKey: GJNNIRNIXNLOJP-ONEGZZNKSA-N
- CAS Registry Number: 35237-62-8
- Chemical structure:
View 3d structure (requires JavaScript / HTML 5) - Stereoisomers:
- Other names: 9-Dodecen-1-ol, (E)-; (9E)-9-Dodecen-1-ol; 9-Dodecenol, E; (E)9-Dodecen-1-ol; 9-Dodecen-1-ol, (9E)-; trans-9-Dodecen-1-ol; (E)-9-Dodecenyl alcohol; 9-Dodecen-1-ol

Phase change data

Data compiled by: William E. Acree, Jr., James S. Chickos
Quantity | Value | Units | Method | Reference | Comment |
---|---|---|---|---|---|
ΔvapH° | 91.7 | kJ/mol | CGC | Ova, Koultek, et al., 2000 | Based on data from 333. to 373. K. See also Koutek, Hoskovec, et al., 1994. |

Kovats' RI, non-polar column, isothermal

Column type | Active phase | Temperature (C) | I | Reference | Comment |
---|---|---|---|---|---|
Packed | OV-101 | 130. | 1428. | Berezkin and Returnsky, 1984 | Chromaton N-AW; Column length: 1. m |

Van Den Dool and Kratz RI, non-polar column, temperature ramp

Column type | Active phase | I | Reference | Comment |
---|---|---|---|---|
Capillary | DB-5 | 1470. | Marques, McElfresh, et al., 2000 | 30. m/0.25 mm/0.25 μm, 100. C @ 1. min, 5. K/min, 275. C @ 3. min |

Van Den Dool and Kratz RI, polar column, temperature ramp

Column type | Active phase | I | Reference | Comment |
---|---|---|---|---|
Capillary | DB-Wax | 2013. | Marques, McElfresh, et al., 2000 | 30. m/0.32 mm/0.25 μm, 100. C @ 1. min, 5. K/min; Tend: 240. C |

Normal alkane RI, non-polar column, temperature ramp

Column type | Active phase | I | Reference | Comment |
---|---|---|---|---|
Capillary | DB-5 | 1469. | Sasaerila, Gries, et al., 1997 | 30. m/0.25 mm/0.32 μm, 10. K/min; Tstart: 50. C; Tend: 200. C |

Normal alkane RI, polar column, isothermal

Column type | Active phase | Temperature (C) | I | Reference | Comment |
---|---|---|---|---|---|
Capillary | PEG | 160. | 2043. | Guo, Yuan, et al., 1984 | Column length: 30. m; Column diameter: 0.36 mm |
Capillary | FFAP | 210. | 1994. | Guo, Yuan, et al., 1984 | Column length: 80. m; Column diameter: 0.30 mm |

References

Ova, Koultek, et al., 2000
Ova, P.V.; Koultek, B.; Hoskovec, M.,
Practice Oriented Results on Use and Production of Neem Ingredients and Pheromones VI, H. Kleeberg and C.P.W. Zebitz, ed(s)., Druck and Graphic, Giessen, 2000, 211-218. [all data]
Koutek, Hoskovec, et al., 1994
Koutek, Bohumír; Hoskovec, Michal; Vrkocová, Pavlína; Konecný, Karel; Feltl, Ladislav,
Gas chromatographic determination of vapour pressures of pheromone-like compounds II. Alcohols,
Journal of Chromatography A, 1994, 679, 2, 307-317, https://doi.org/10.1016/0021-9673(94)80573-3
. [all data]
Berezkin and Returnsky, 1984
Berezkin, V.G.; Returnsky, V.N.,
Calculation of invariant retention indices for a series of aliphatic alcohols and acetates by consideration of adsorption at the interface,
J. Chromatogr., 1984, 292, 1, 9-17, https://doi.org/10.1016/S0021-9673(01)96185-0
. [all data]
Marques, McElfresh, et al., 2000
Marques, F.A.; McElfresh, J.S.; Millar, J.G.,
Kováts retention indexes of monounsaturated C12, C14, and C16 alcohols, acetates and aldehydes commonly found in lepidopteran pheromone blends,
J. Braz. Chem. Soc., 2000, 11, 6, 592-599, https://doi.org/10.1590/S0103-50532000000600007
. [all data]
Sasaerila, Gries, et al., 1997
Sasaerila, Y.; Gries, G.; Khaskin, G.; Gries, R.; Hardi,
Identification of sex pheromone components of nettle caterpillar, Setothosea asigna,
J. Chem. Ecol., 1997, 23, 9, 2187-2196, https://doi.org/10.1023/B:JOEC.0000006438.03728.1a
. [all data]
Guo, Yuan, et al., 1984
Guo, G.; Yuan, M.; Lin, G.,
Study on the resolution of geometric isomers of insect sex pheromones with capillary column GC,
You ji hua xue, 1984, 5, 349-354. [all data]