5-Chloro-2'-fluoro-2-hydroxyethyaminobenzophenone
- Formula: C15H13ClFNO2
- Molecular weight: 293.721
- IUPAC Standard InChIKey: CKDXNSUKTLFLRM-UHFFFAOYSA-N
- CAS Registry Number: 35231-38-0
- Chemical structure:
View 3d structure (requires JavaScript / HTML 5) - Other names: 2-Hydroxyethylamino-5-chlor-2'-fluor-benzophenone

Kovats' RI, non-polar column, isothermal

Column type | Active phase | Temperature (C) | I | Reference | Comment |
---|---|---|---|---|---|
Packed | SE-30 | 280. | 2500. | Schütz, 1982 | N2 |

References

Schütz, 1982
Schütz, H.,
Benzodiazepines, Springer-Verlag, New York, 1982, 438. [all data]