Hexane, 2,2,5-trimethyl-
- Formula: C9H20
- Molecular weight: 128.2551
- IUPAC Standard InChIKey: HHOSMYBYIHNXNO-UHFFFAOYSA-N
- CAS Registry Number: 3522-94-9
- Chemical structure:
View 3d structure (requires JavaScript / HTML 5) - Other names: 2,2,5-Trimethylhexane

Condensed phase thermochemistry data

Data compiled by: Hussein Y. Afeefy, Joel F. Liebman, and Stephen E. Stein
Quantity | Value | Units | Method | Reference | Comment |
---|---|---|---|---|---|
ΔfH°liquid | -293.3 ± 1.0 | kJ/mol | Ccr | Good, 1969 | |
Quantity | Value | Units | Method | Reference | Comment |
ΔcH°liquid | -6106.55 ± 0.84 | kJ/mol | Ccr | Good, 1969 | Corresponding ΔfHºliquid = -293.3 kJ/mol (simple calculation by NIST; no Washburn corrections) |

Phase change data

Data compiled as indicated in comments:
BS - Robert L. Brown and Stephen E. Stein
TRC - Thermodynamics Research Center, NIST Boulder Laboratories, Chris Muzny director
AC - William E. Acree, Jr., James S. Chickos
ALS - Hussein Y. Afeefy, Joel F. Liebman, and Stephen E. Stein
Quantity | Value | Units | Method | Reference | Comment |
---|---|---|---|---|---|
Tboil | 397. ± 2. | K | AVG | N/A | Average of 19 values; Individual data points |
Quantity | Value | Units | Method | Reference | Comment |
Tfus | 167.2 ± 0.3 | K | AVG | N/A | Average of 8 values; Individual data points |
Quantity | Value | Units | Method | Reference | Comment |
Tc | 569.8 ± 2.0 | K | N/A | Daubert, 1996 | |
Tc | 569.9 | K | N/A | Francis, 1957 | Uncertainty assigned by TRC = 2. K; TRC |
Quantity | Value | Units | Method | Reference | Comment |
ΔvapH° | 40.21 | kJ/mol | N/A | Majer and Svoboda, 1985 | |
ΔvapH° | 40.2 | kJ/mol | N/A | Reid, 1972 | AC |
ΔvapH° | 40.2 | kJ/mol | C | Osborne and Ginnings, 1947 | AC |
ΔvapH° | 40.17 | kJ/mol | C | Osborne and Ginnings, 1947, 2 | ALS |
Enthalpy of vaporization
ΔvapH (kJ/mol) | Temperature (K) | Method | Reference | Comment |
---|---|---|---|---|
33.65 | 397.2 | N/A | Majer and Svoboda, 1985 | |
40.1 | 303. | A | Stephenson and Malanowski, 1987 | Based on data from 288. to 399. K.; AC |
41.1 | 288. | A,IP | Stephenson and Malanowski, 1987 | Based on data from 238. to 303. K. See also Osborn and Douslin, 1974.; AC |
38.5 | 334. | N/A | Forziati, Norris, et al., 1949 | Based on data from 319. to 398. K.; AC |
Antoine Equation Parameters
log10(P) = A − (B / (T + C))
P = vapor pressure (bar)
T = temperature (K)
View plot Requires a JavaScript / HTML 5 canvas capable browser.
Temperature (K) | A | B | C | Reference | Comment |
---|---|---|---|---|---|
238. to 303. | 4.2515 | 1471.761 | -48.948 | Osborn and Douslin, 1974 | Coefficents calculated by NIST from author's data. |
319.29 to 398.20 | 3.97027 | 1330.147 | -61.722 | Forziati, Norris, et al., 1949, 2 | Coefficents calculated by NIST from author's data. |

Henry's Law data

Data compiled by: Rolf Sander
Henry's Law constant (water solution)
kH(T) = k°H exp(d(ln(kH))/d(1/T) ((1/T) - 1/(298.15 K)))
k°H = Henry's law constant for solubility in water at 298.15 K (mol/(kg*bar))
d(ln(kH))/d(1/T) = Temperature dependence constant (K)
k°H (mol/(kg*bar)) | d(ln(kH))/d(1/T) (K) | Method | Reference | Comment |
---|---|---|---|---|
0.00019 | Q | N/A | missing citation give several references for the Henry's law constants but don't assign them to specific species. | |
0.00029 | L | N/A |

Gas phase thermochemistry data

Data compiled by: Donald R. Burgess, Jr.
Quantity | Value | Units | Method | Reference | Comment |
---|---|---|---|---|---|
ΔfH°gas | -253.1 | kJ/mol | N/A | Good, 1969 | Value computed using ΔfHliquid° value of -293.3±1 kj/mol from Good, 1969 and ΔvapH° value of 40.21 kj/mol from missing citation. |

Normal alkane RI, non-polar column, temperature ramp

Data compiled by: NIST Mass Spectrometry Data Center, William E. Wallace, director

Column type CapillaryCapillaryCapillaryCapillary
Active phase Polydimethyl siloxane: CP-Sil 5 CBPetrocol DHOV-101SF-96
Column length (m) 60.100.50.111.
Carrier gas HeliumHeliumHeliumNitrogen
Substrate
Column diameter (mm) 0.250.250.200.76
Phase thickness (μm) 1.00.500.50
Tstart (C) 45.20.30.
Tend (C) 210.220.100.130.
Heat rate (K/min) 3.615.1.3.
Initial hold (min) 1.4515.6.8.
Final hold (min) 2.7230. 40.
I 785.783.784.785.
ReferenceBramston-Cook, 2013Supelco, 2012Orav, Kailas, et al., 1999Donetzhuber, Johansson, et al., 1976
Comment MSDC-RI MSDC-RI MSDC-RI MSDC-RI

Normal alkane RI, non-polar column, custom temperature program

Data compiled by: NIST Mass Spectrometry Data Center, William E. Wallace, director

Column type CapillaryCapillaryCapillaryCapillaryCapillary
Active phase Methyl SiliconeOV-101Polydimethyl siloxanePolydimethyl siloxanesMethyl Silicone
Column length (m)
Carrier gas
Substrate
Column diameter (mm)
Phase thickness (μm)
Program not specifiednot specifiednot specifiednot specifiednot specified
I 776.777.791.786.782.
ReferenceFeng and Mu, 2007Du and Liang, 2003Junkes, Castanho, et al., 2003Yin, Guo, et al., 2001Spieksma, 1999
Comment MSDC-RI MSDC-RI MSDC-RI MSDC-RI MSDC-RI
Column type CapillaryCapillaryCapillaryPacked
Active phase SqualaneOV-1, SE-30, Methyl silicone, SP-2100, OV-101, DB-1, etc.OV-1, SE-30, Methyl silicone, SP-2100, OV-101, DB-1, etc.SE-30
Column length (m)  50.50.6.1
Carrier gas  HydrogenHydrogenN2
Substrate    Chromosorb W
Column diameter (mm)  0.320.32
Phase thickness (μm)
Program not specifiednot specifiednot specified50C910min) => 20C/min => 90(6min) => 10C/min => 150C(hold)
I 773.781.786.795.
ReferencePetrov, 1984Waggott and Davies, 1984Waggott and Davies, 1984Robinson and Odell, 1971
Comment MSDC-RI MSDC-RI MSDC-RI MSDC-RI

Kovats' RI, non-polar column, custom temperature program

Data compiled by: NIST Mass Spectrometry Data Center, William E. Wallace, director

Column type CapillaryCapillaryCapillary
Active phase Petrocol DH-100DB-1Squalane
Column length (m) 100.60.
Carrier gas HeHe
Substrate
Column diameter (mm) 0.20.32
Phase thickness (μm)  1.0
Program 5C(10min) => 5C/min => 50C(48min) => 1.5C/min => 195C(91min)-40 C for 12 min; -40 - 125 C at 3 deg.min; 125-185 C at 6 deg/min; 185 - 220 C at 20 deg/min; hold 220 C for 2 minnot specified
I 782.9786.777.
ReferenceHaagen-Smit Laboratory, 1997Hoekman, 1993Korol and Lysyuk, 1980
Comment MSDC-RI MSDC-RI MSDC-RI

References

Good, 1969
Good, W.D.,
Enthalpies of combustion and formation of 11 isomeric nonanes,
J. Chem. Eng. Data, 1969, 14, 231-235. [all data]
Daubert, 1996
Daubert, T.E.,
Vapor-Liquid Critical Properties of Elements and Compounds. 5. Branched Alkanes and Cycloalkanes,
J. Chem. Eng. Data, 1996, 41, 365-372. [all data]
Francis, 1957
Francis, A.W.,
Pressure-Temperature-Liquid Density Relations of Pure Hydrocarbons,
Ind. Eng. Chem., 1957, 49, 1779. [all data]
Majer and Svoboda, 1985
Majer, V.; Svoboda, V.,
Enthalpies of Vaporization of Organic Compounds: A Critical Review and Data Compilation, Blackwell Scientific Publications, Oxford, 1985, 300. [all data]
Reid, 1972
Reid, Robert C.,
Handbook on vapor pressure and heats of vaporization of hydrocarbons and related compounds, R. C. Wilhort and B. J. Zwolinski, Texas A Research Foundation. College Station, Texas(1971). 329 pages.$10.00,
AIChE J., 1972, 18, 6, 1278-1278, https://doi.org/10.1002/aic.690180637
. [all data]
Osborne and Ginnings, 1947
Osborne, Nathan S.; Ginnings, Defoe C.,
Measurements of heat of vaporization and heat capacity of a number of hydrocarbons,
J. RES. NATL. BUR. STAN., 1947, 39, 5, 453-17, https://doi.org/10.6028/jres.039.031
. [all data]
Osborne and Ginnings, 1947, 2
Osborne, N.S.; Ginnings, D.C.,
Measurements of heat of vaporization and heat capacity of a number of hydrocarbons,
J. Res. NBS, 1947, 39, 453-477. [all data]
Stephenson and Malanowski, 1987
Stephenson, Richard M.; Malanowski, Stanislaw,
Handbook of the Thermodynamics of Organic Compounds, 1987, https://doi.org/10.1007/978-94-009-3173-2
. [all data]
Osborn and Douslin, 1974
Osborn, Ann G.; Douslin, Donald R.,
Vapor-pressure relations for 15 hydrocarbons,
J. Chem. Eng. Data, 1974, 19, 2, 114-117, https://doi.org/10.1021/je60061a022
. [all data]
Forziati, Norris, et al., 1949
Forziati, Alphonse F.; Norris, William R.; Rossini, Frederick D.,
Vapor pressures and boiling points of sixty API-NBS hydrocarbons,
J. RES. NATL. BUR. STAN., 1949, 43, 6, 555-17, https://doi.org/10.6028/jres.043.050
. [all data]
Forziati, Norris, et al., 1949, 2
Forziati, A.F.; Norris, W.R.; Rossini, F.D.,
Vapor Pressures and Boiling Points of Sixty API-NBS Hydrocarbons,
J. Res. Natl. Bur. Stand. (U.S.), 1949, 43, 6, 555-563, https://doi.org/10.6028/jres.043.050
. [all data]