11-Tetradecen-1-ol, (E)-
- Formula: C14H28O
- Molecular weight: 212.3715
- IUPAC Standard InChIKey: YGHAIPJLMYTNAI-ONEGZZNKSA-N
- CAS Registry Number: 35153-18-5
- Chemical structure:
View 3d structure (requires JavaScript / HTML 5) - Stereoisomers:
- Other names: (E)-11-Tetradecen-1-ol; E-11-Tetradecenol; (11E)-11-Tetradecen-1-ol; 11-Tetradecenol, E; (E)-tetradec-11-enol

Van Den Dool and Kratz RI, non-polar column, temperature ramp

Column type | Active phase | I | Reference | Comment |
---|---|---|---|---|
Capillary | DB-5 | 1673. | Marques, McElfresh, et al., 2000 | 30. m/0.25 mm/0.25 μm, 100. C @ 1. min, 5. K/min, 275. C @ 3. min |

References

Marques, McElfresh, et al., 2000
Marques, F.A.; McElfresh, J.S.; Millar, J.G.,
Kováts retention indexes of monounsaturated C12, C14, and C16 alcohols, acetates and aldehydes commonly found in lepidopteran pheromone blends,
J. Braz. Chem. Soc., 2000, 11, 6, 592-599, https://doi.org/10.1590/S0103-50532000000600007
. [all data]