Acetamide, N-[3-(trifluoromethyl)phenyl]-
- Formula: C9H8F3NO
- Molecular weight: 203.1611
- IUPAC Standard InChIKey: HNIPNANLYHXYDE-UHFFFAOYSA-N
- CAS Registry Number: 351-36-0
- Chemical structure:
View 3d structure (requires JavaScript / HTML 5) - Other names: m-Acetotoluidide, α,α,α-trifluoro-; α,α,α-Trifluoro-m-acetotoluidide; m-(Trifluoromethyl)acetanilide; 3-(Trifluoromethyl)acetanilide; N-(α,α,α-Trifluoro-m-tolyl)acetamide; 3-Acetamidobenzotrifluoride; 3'-Trifluoromethylacetanilide; m-Acetaminobenzotrifluoride; Acetanilide, 3-(trifluoromethyl)-; USAF MA-14; NSC 30581

Condensed phase thermochemistry data

Data compiled by: Hussein Y. Afeefy, Joel F. Liebman, and Stephen E. Stein
Quantity | Value | Units | Method | Reference | Comment |
---|---|---|---|---|---|
ΔcH°liquid | -4364.7 | kJ/mol | Ccb | Swarts, 1919 | Not corrected for CODATA value of ΔfH |

Kovats' RI, non-polar column, temperature ramp

Column type | Active phase | I | Reference | Comment |
---|---|---|---|---|
Capillary | HP-1 | 1400. | Staack, Fritschi, et al., 2003 | 25. m/0.20 mm/0.33 μm, He, 100. C @ 3. min, 30. K/min, 310. C @ 8. min |

References

Swarts, 1919
Swarts, F.,
Etudes thermochimiques sur les combinaisons organiques fluorees,
J. Chim. Phys., 1919, 17, 3-70. [all data]
Staack, Fritschi, et al., 2003
Staack, R.F.; Fritschi, G.; Maurer, H.H.,
New designer drug 1-(3-trifluoromethylphenyl) piperazine (TFMPP): gas chromatography/mass spectrometry and liquid chromatography/mass spectrometry studies on its phase I and II metabolism and on its toxicological detection in rat urine,
J. Mass Spectrom., 2003, 38, 9, 971-981, https://doi.org/10.1002/jms.513
. [all data]