3'-Fluoroacetanilide
- Formula: C8H8FNO
- Molecular weight: 153.1536
- IUPAC Standard InChIKey: AQLLDCFUQXGLHM-UHFFFAOYSA-N
- CAS Registry Number: 351-28-0
- Chemical structure:
View 3d structure (requires JavaScript / HTML 5) - Other names: 3-Fluoroacetanilide; m-Fluoroacetanilide; Acetamide, N-(3-fluorophenyl)-; Acetanilide, 3'-fluoro-; N-(3-fluorophenyl)acetamide

Condensed phase thermochemistry data

Data compiled by: Hussein Y. Afeefy, Joel F. Liebman, and Stephen E. Stein
Quantity | Value | Units | Method | Reference | Comment |
---|---|---|---|---|---|
ΔcH°solid | -4092. | kJ/mol | Ccb | Swarts, 1919 | Not corrected for CODATA value of ΔfH |

References

Swarts, 1919
Swarts, F.,
Etudes thermochimiques sur les combinaisons organiques fluorees,
J. Chim. Phys., 1919, 17, 3-70. [all data]