α-Fluorocinnamic acid
- Formula: C9H7FO2
- Molecular weight: 166.1491
- IUPAC Standard InChIKey: QONCEXMULRJPPY-VURMDHGXSA-N
- CAS Registry Number: 350-90-3
- Chemical structure:
View 3d structure (requires JavaScript / HTML 5) - Other names: 2-Propenoic acid, 2-fluoro-3-phenyl-; Cinnamic acid, α-fluoro-; alpha-Fluorocinnamic acid

Condensed phase thermochemistry data

Data compiled by: Hussein Y. Afeefy, Joel F. Liebman, and Stephen E. Stein
Quantity | Value | Units | Method | Reference | Comment |
---|---|---|---|---|---|
ΔcH°solid | -4240.69 | kJ/mol | Ccb | Swarts, 1919 | Not corrected for CODATA value of ΔfH |

Phase change data

Data compiled by: Robert L. Brown and Stephen E. Stein
Quantity | Value | Units | Method | Reference | Comment |
---|---|---|---|---|---|
Tboil | 563.2 | K | N/A | Weast and Grasselli, 1989 |

References

Swarts, 1919
Swarts, F.,
Etudes thermochimiques sur les combinaisons organiques fluorees,
J. Chim. Phys., 1919, 17, 3-70. [all data]
Weast and Grasselli, 1989
CRC Handbook of Data on Organic Compounds, 2nd Editon, Weast,R.C and Grasselli, J.G., ed(s)., CRC Press, Inc., Boca Raton, FL, 1989, 1. [all data]