Cyclohexane, 1,4-dibromo-
- Formula: C6H10Br2
- Molecular weight: 241.952
- IUPAC Standard InChIKey: OALGWDQLKYPDRK-UHFFFAOYSA-N
- CAS Registry Number: 35076-92-7
- Chemical structure:
View 3d structure (requires JavaScript / HTML 5) - Stereoisomers:
- Other names: 1,4-Dibromocyclohexane

Phase change data

Data compiled by: Thermodynamics Research Center, NIST Boulder Laboratories, Chris Muzny director
Quantity | Value | Units | Method | Reference | Comment |
---|---|---|---|---|---|
Tfus | 278.85 | K | N/A | Timmermans, 1952 | Uncertainty assigned by TRC = 0.5 K |

References

Timmermans, 1952
Timmermans, J.,
Freezing points of organic compounds. VVI New determinations.,
Bull. Soc. Chim. Belg., 1952, 61, 393. [all data]