trans-Linalool oxide (furanoid)
- Formula: C10H18O2
- Molecular weight: 170.2487
- IUPAC Standard InChIKey: BRHDDEIRQPDPMG-SCZZXKLOSA-N
- CAS Registry Number: 34995-77-2
- Chemical structure:
View 3d structure (requires JavaScript / HTML 5) - Species with the same structure:
- Stereoisomers:
- Linalool oxide
- 2-Furanmethanol, 5-ethenyltetrahydro-α,α,5-trimethyl-, cis-
- Linalool oxide
- Linalol oxide furanoid B
- Linalool Z-furanic oxide
- Linalool oxide 2
- Linalool oxide #1
- Linalool oxide #2
- Linalool oxide-I (furanoid)
- Linalool oxide (isomer I)
- Linalool oxide (isomer II)
- Linallol oxide isomer # 1
- Linalool oxide isomer # 2
- cis-furan Linalool oxide
- cis-Linalool oxide (furan)
- (Z)-Furan linalool oxide
- cis-Linalool oxide I
- (Z)-Linalool oxide (furanoid)
- cis-Linalool oxde, furanoid
- Other names: 2-Furanmethanol, 5-ethenyltetrahydro-α,α,5-trimethyl-, trans-; trans-5-Ethenyltetrahydro-α,α,5-trimethyl-2-furanmethanol; 2-(5-Methyl-5-vinyltetrahydro-2-furanyl)-2-propanol, trans-; (E)-Furan linalool oxide; E-Furanoid linalool oxide; (E)-Linalool furanoxide; (E)-Linalool oxide A; E-Linalool oxide (furan); (E)-Linalool oxide, furanoid; Linalool oxide A (trans-THF); Linalool oxide II (trans, furanoid); Linalool oxide, trans-furanoid; Linalool oxide (trans-THF); t-Furan linalool oxide; trans-Furanic linalool oxid; trans-Furanic linalool oxide; trans-Furan linalool oxide; trans-Linalool furanoid oxide; trans-Linalool furanoxide; trans-Linalool oxide; trans-Linalool oxide (f); trans-Linalool oxide furan; trans-Linalool oxide (furanoid form); trans-Linalool oxide (furan type); trans-Linalool oxide (furanyl ring); trans-Linalool oxide (THF); 2-Furanmethanol, 5-ethenyltetrahydro-α,α,5-trimethyl-, (2R,5R)-rel-; Linalool A oxide; Linalool oxide 2; Linalool oxide A; Linalool oxide II; trans-2-Methyl-2-vinyl-5-(1-hydroxy-1-methylethyl)tetrahydrofuran; trans-2-Vinyl-2-methyl-5-(1-hydroxy-1-methylethyl)tetrahydrofuran; trans-f-Linalool oxide; trans-Furanoid linalool oxide; trans-Linalool 3,6-oxide; Linalool oxide, trans; trans-α,α,5-Trimethyl-5-vinyltetrahydrofurfuryl alcohol; 2-((2R,5R)-5-Methyl-5-vinyltetrahydrofuran-2-yl)propan-2-ol; (E)-Linalool oxide; trans-Linalol oxide (furanoid); trans-Linalol oxide; (E)-Linalol furanoxide; trans-Linalol oxide (f); trans-Linalol oxide fur.; t-Linalool oxide; (E)-Linalol oxide (furanoid); linalool oxide furanoside I; (E)-linalol oxide; trans-5-Trimethyl-2-furanmethanol; Trans linalol furanoxide; linalool oxide A (2-methyl-2-vinyl- 5-(2-hydroxy -2-propyl)-tetrahydrofuran; Linalool oxide 1; tetrahydro-α,α,5-trimethyl-5-vinylfuran-2-methanol

Kovats' RI, non-polar column, temperature ramp

Column type | Active phase | I | Reference | Comment |
---|---|---|---|---|
Capillary | HP-5MS | 1094. | Jalali-Heravi, Zekavat, et al., 2006 | 60. m/0.25 mm/0.25 μm, He, 40. C @ 1. min, 3. K/min, 250. C @ 20. min |
Capillary | DB-5 | 1065. | Mevy, Bessiere, et al., 2006 | 25. m/0.2 mm/0.15 μm, He, 60. C @ 3. min, 3. K/min; Tend: 220. C |
Capillary | DB-1 | 1087. | Mevy, Bessiere, et al., 2006, 2 | He, 60. C @ 3. min, 3. K/min; Column length: 25. m; Column diameter: 0.2 mm; Tend: 220. C |
Capillary | BP-1 | 1073. | Srivastava, Srivastava, et al., 2006 | 30. m/0.32 mm/0.25 μm, N2, 5. K/min, 220. C @ 3. min; Tstart: 60. C |
Capillary | CP Sil 8 CB | 1076. | Tayoub, Schwob, et al., 2006 | 30. m/0.25 mm/0.25 μm, H2, 50. C @ 2. min, 3. K/min; Tend: 220. C |
Capillary | CP Sil 8 CB | 1088. | Tayoub, Schwob, et al., 2006, 2 | 30. m/0.25 mm/0.25 μm, H2, 50. C @ 2. min, 3. K/min; Tend: 220. C |
Capillary | SPB-1 | 1075. | Walde, Jyothirmayi, et al., 2006 | 30. m/0.32 mm/0.25 μm, He, 60. C @ 4. min, 4. K/min, 240. C @ 2. min |
Capillary | DB-5 | 1074. | Adams and Nguyen, 2005 | 30. m/0.26 mm/0.25 μm, He, 3. K/min; Tstart: 60. C; Tend: 246. C |
Capillary | DB-5 | 1097. | Avato, Raffo, et al., 2004 | 30. m/0.25 mm/0.25 μm, H2, 4. K/min, 280. C @ 30. min; Tstart: 40. C |
Capillary | SPB-5 | 1091. | Gauvin, Lecomte, et al., 2004 | 60. m/0.32 mm/1. μm, He, 4. K/min, 200. C @ 30. min; Tstart: 60. C |
Capillary | CP Sil 8 CB | 1083. | Schwob, Bessiere, et al., 2004 | 30. m/0.25 mm/0.25 μm, H2, 50. C @ 2. min, 3. K/min; Tend: 220. C |
Capillary | DB-5 | 1072. | Amparo Blázquez, Pérez, et al., 2003 | He, 40. C @ 5. min, 3. K/min, 280. C @ 5. min; Column length: 25. m; Column diameter: 0.25 mm |
Capillary | DB-5 | 1098. | Baranauskiene, Venskutonis, et al., 2003 | 50. m/0.32 mm/0.25 μm, He, 50. C @ 2. min, 5. K/min, 280. C @ 10. min |
Capillary | HP-5 | 1091. | Nickavar, Salehi-Sormagi, et al., 2002 | 30. m/0.25 mm/0.25 μm, He, 4. K/min; Tstart: 60. C; Tend: 275. C |
Capillary | BP-1 | 1077. | Raina, Srivastava, et al., 2002 | 25. m/0.55 mm/0.25 μm, N2, 5. K/min, 220. C @ 15. min; Tstart: 60. C |
Capillary | Cross-Linked Methylsilicone | 1077. | Rajeswara Rao, Kaul, et al., 2002 | 50. m/0.2 mm/0.25 μm, He, 4. K/min; Tstart: 100. C; Tend: 280. C |
Capillary | BP-1 | 1076. | Rajeswara Rao, 2002 | 25. m/0.5 mm/0.25 μm, N2, 5. K/min, 220. C @ 10. min; Tstart: 60. C |
Capillary | BP-1 | 1076. | Rao B.R.R., 2002 | 25. m/0.5 mm/0.25 μm, 5. K/min, 220. C @ 10. min; Tstart: 60. C |
Capillary | BP-1 | 1074. | Shawl, Srivastava, et al., 2002 | 30. m/0.32 mm/0.25 μm, N2, 5. K/min, 220. C @ 13. min; Tstart: 60. C |
Capillary | BP-1 | 1076. | Jain, Aggarwal, et al., 2001 | 25. m/0.55 mm/0.25 μm, N2, 5. K/min, 220. C @ 15. min; Tstart: 60. C |
Capillary | BP-1 | 1070. | Jain, Srivastava, et al., 2001 | 25. m/0.55 mm/0.25 μm, N2, 5. K/min, 220. C @ 15. min; Tstart: 60. C |
Capillary | BP-1 | 1078. | Raina, Srivastava, et al., 2001 | 25. m/0.55 mm/0.25 μm, N2, 5. K/min, 220. C @ 15. min; Tstart: 60. C |
Capillary | HP-5 | 1088. | Tzakou and Couladis, 2001 | 30. m/0.25 mm/0.25 μm, He, 3. K/min; Tstart: 60. C; Tend: 280. C |
Capillary | SE-54 | 1074. | Adams, 2000 | 30. m/0.26 mm/0.25 μm, He, 3. K/min; Tstart: 60. C; Tend: 246. C |
Capillary | SE-54 | 1074. | Adams, 2000, 2 | 30. m/0.26 mm/0.25 μm, 3. K/min; Tstart: 60. C; Tend: 246. C |
Capillary | DB-5 | 1074. | Adams, 2000, 3 | 30. m/0.26 mm/0.25 μm, He, 3. K/min; Tstart: 60. C; Tend: 246. C |
Capillary | BP-1 | 1076. | Rao, Kaul, et al., 2000 | N2, 5. K/min, 220. C @ 10. min; Column length: 25. m; Column diameter: 0.5 mm; Tstart: 60. C |
Capillary | BP-1 | 1076. | Rao, Sastry, et al., 2000 | 25. m/0.50 mm/0.25 μm, N2, 5. K/min, 220. C @ 10. min; Tstart: 60. C |
Capillary | DB-5 | 1074. | Adams, 1999 | 30. m/0.26 mm/0.25 μm, He, 3. K/min; Tstart: 60. C; Tend: 246. C |
Capillary | CP Sil 5 CB | 1078. | Kaul, Gujral, et al., 1999 | He, 5. K/min; Column length: 25. m; Column diameter: 0.25 mm; Tstart: 60. C; Tend: 280. C |
Capillary | BP-1 | 1071. | Kulkarni, Mallavarapu, et al., 1998 | N2, 5. K/min; Column length: 25. m; Column diameter: 0.25 mm; Tstart: 60. C; Tend: 220. C |
Capillary | Methyl Silicone | 1075. | Mallavarapu, Rao, et al., 1998 | N2, 5. K/min; Column length: 25. m; Column diameter: 0.5 mm; Tstart: 60. C; Tend: 220. C |
Capillary | DB-1 | 1080. | Breheret, Talou, et al., 1997 | 25. m/0.23 mm/0.13 μm, He, 60. C @ 2. min, 4. K/min; Tend: 200. C |
Capillary | SE-30 | 1078. | Jantan, Ahmad, et al., 1996 | N2, 60. C @ 10. min, 3. K/min, 180. C @ 1. min; Column length: 25. m; Column diameter: 0.2 mm |
Capillary | OV-101 | 1078. | von Poser, Menut, et al., 1996 | 25. m/0.25 mm/0.25 μm, N2, 5. K/min; Tstart: 50. C; Tend: 200. C |
Capillary | OV-101 | 1074. | Menut, Molangui, et al., 1995 | N2, 5. K/min; Column length: 25. m; Column diameter: 0.25 mm; Tstart: 50. C; Tend: 200. C |
Capillary | OV-101 | 1079. | Morales and Duque, 1987 | He, 2. K/min; Column length: 25. m; Column diameter: 0.31 mm; Tstart: 60. C; Tend: 200. C |
Capillary | OV-101 | 1079. | Yamaguchi and Shibamoto, 1981 | N2, 2. K/min; Column length: 70. m; Column diameter: 0.28 mm; Tstart: 80. C; Tend: 200. C |
Capillary | OV-101 | 1081. | Yamaguchi and Shibamoto, 1981 | N2, 2. K/min; Column length: 70. m; Column diameter: 0.28 mm; Tstart: 80. C; Tend: 200. C |
Capillary | OV-101 | 1067. | Yamaguchi and Shibamoto, 1979 | N2, 2. K/min; Column length: 70. m; Column diameter: 0.28 mm; Tstart: 80. C; Tend: 200. C |

Kovats' RI, non-polar column, custom temperature program

Column type | Active phase | I | Reference | Comment |
---|---|---|---|---|
Capillary | HP-5MS | 1076. | Alissandrakis E., Tarantilis P.A., et al., 2007 | 30. m/0.25 mm/0.25 μm, He; Program: 40C(3min) => 3C/min => 160C => 10C/min => 200C |
Capillary | HP-5 | 1073. | Daferera, Ziogas, et al., 2003 | 30. m/0.25 mm/0.25 μm, He; Program: 40C (3min) => 3C/min => 180C => 30C/min => 270C (5min) |
Capillary | BP-1 | 1074. | Rao, Kaul, et al., 2003 | 30. m/0.32 mm/0.25 μm, N2; Program: 60C => 5.5C/min => 220C => 3.5C/min => 245C |
Capillary | HP-1 | 1082. | Wongpornchai, Sriseadka, et al., 2003 | 30. m/0.25 mm/0.25 μm, He; Program: 35C => 2C/min => 100C => 5C/min => 230C(2min) |
Capillary | SPB-1 | 1073. | Borse, Jagan Mohan Rao, et al., 2002 | 30. m/0.32 mm/0.25 μm, He; Program: 40C(3min) => 2C/min => 100C => 4C/min => 220C (7min) |

Kovats' RI, polar column, isothermal

Column type | Active phase | Temperature (C) | I | Reference | Comment |
---|---|---|---|---|---|
Capillary | Carbowax 20M | 150. | 1485. | Tudor, Moldovan, et al., 1999 | Phase thickness: 0.45 μm |

Kovats' RI, polar column, temperature ramp

Column type | Active phase | I | Reference | Comment |
---|---|---|---|---|
Capillary | PE-Wax | 1460. | Chandravadana, Vekateshwarlu, et al., 2005 | N2, 60. C @ 4. min, 5. K/min, 200. C @ 5. min; Column length: 30. m; Column diameter: 0.25 mm |
Capillary | DB-Wax | 1452. | Avato, Raffo, et al., 2004 | 30. m/0.25 mm/0.25 μm, H2, 40. C @ 2. min, 4. K/min, 260. C @ 15. min |
Capillary | HP-Wax | 1490. | Gauvin, Lecomte, et al., 2004 | 50. m/0.2 mm/0.4 μm, He, 4. K/min, 230. C @ 30. min; Tstart: 60. C |
Capillary | Supelcowax-10 | 1462. | Tzakou and Couladis, 2001 | 30. m/0.32 mm/0.25 μm, He, 3. K/min; Tstart: 75. C; Tend: 230. C |
Capillary | PE-Wax | 1460. | Venkateshwarlu, Chandravadana, et al., 1999 | N2, 60. C @ 4. min, 5. K/min, 200. C @ 5. min; Column length: 30. m; Column diameter: 0.25 mm |
Capillary | Carbowax 20M | 1454. | Kulkarni, Mallavarapu, et al., 1998 | N2, 5. K/min; Column length: 25. m; Column diameter: 0.25 mm; Tstart: 60. C; Tend: 200. C |
Capillary | Carbowax 20M | 1451. | Mallavarapu, Rao, et al., 1998 | N2, 5. K/min; Column length: 25. m; Column diameter: 0.5 mm; Tstart: 60. C; Tend: 200. C |
Capillary | DB-Wax | 1471. | Umano, Hagi, et al., 1994 | He, 40. C @ 2. min, 2. K/min; Column length: 60. m; Column diameter: 0.25 mm; Tend: 200. C |
Capillary | Supelcowax-10 | 1482. | Wong and Tie, 1993 | He, 35. C @ 5. min, 3. K/min, 200. C @ 20. min; Column length: 60. m; Column diameter: 0.25 mm |
Capillary | DB-Wax | 1450. | Tatsuka, Suekane, et al., 1990 | 60. m/0.25 mm/0.25 μm, He, 40. C @ 5. min, 3. K/min; Tend: 200. C |
Capillary | DB-Wax | 1452. | Tatsuka, Suekane, et al., 1990 | 60. m/0.25 mm/0.25 μm, He, 40. C @ 5. min, 3. K/min; Tend: 200. C |
Capillary | Carbowax 20M | 1473. | Nishimura, Yamaguchi, et al., 1989 | 2. K/min; Column length: 50. m; Column diameter: 0.22 mm; Tstart: 80. C; Tend: 200. C |
Capillary | BP-20 | 1451. | MacLeod and Pieris, 1983 | H2, 65. C @ 3. min, 12. K/min; Column length: 25. m; Column diameter: 0.20 mm; Tend: 180. C |
Capillary | Carbowax 20M | 1443. | Yamaguchi and Shibamoto, 1981 | N2, 2. K/min; Column length: 70. m; Column diameter: 0.28 mm; Tstart: 80. C; Tend: 200. C |
Capillary | Carbowax 20M | 1444. | Yamaguchi and Shibamoto, 1981 | N2, 2. K/min; Column length: 70. m; Column diameter: 0.28 mm; Tstart: 80. C; Tend: 200. C |
Capillary | Carbowax 20M | 1432. | Tressl, Friese, et al., 1978 | He, 2. K/min; Column length: 50. m; Column diameter: 0.28 mm; Tstart: 70. C; Tend: 190. C |
Capillary | Carbowax 20M | 1432. | Tressl, Friese, et al., 1978, 2 | He, 2. K/min; Column length: 50. m; Column diameter: 0.28 mm; Tstart: 70. C; Tend: 190. C |

Van Den Dool and Kratz RI, non-polar column, temperature ramp

Column type | Active phase | I | Reference | Comment |
---|---|---|---|---|
Capillary | DB-5MS | 1086. | Cho, Namgung, et al., 2008 | 30. m/0.25 mm/0.25 μm, He, 40. C @ 1. min, 4. K/min, 200. C @ 10. min |
Capillary | HP-5 | 1092. | Quijano, Salamanca, et al., 2007 | 30. m/0.25 mm/0.25 μm, He, 50. C @ 4. min, 4. K/min, 250. C @ 10. min |
Capillary | SPB-1 | 1102. | Radulovic, Lazarevic, et al., 2007 | 30. m/0.25 mm/0.25 μm, He, 50. C @ 3. min, 5. K/min, 250. C @ 15. min |
Capillary | HP-5MS | 1065. | Radulovic, Lazarevic, et al., 2007 | 30. m/0.25 mm/0.25 μm, He, 60. C @ 5. min, 4. K/min; Tend: 280. C |
Capillary | DB-5 | 1075. | Sabulal, Dan, et al., 2007 | 30. m/0.25 mm/0.25 μm, He, 5. K/min; Tstart: 60. C; Tend: 260. C |
Capillary | DB-5 | 1088. | Telascrea, de Araujo, et al., 2007 | 30. m/0.25 mm/0.25 μm, He, 3. K/min; Tstart: 60. C; Tend: 240. C |
Capillary | CP Sil 5 CB | 1068. | Andrianoelisoa H.S., Menut C., et al., 2006 | 30. m/0.25 mm/0.25 μm, N2, 5. K/min; Tstart: 50. C; Tend: 200. C |
Capillary | DB-5 | 1087. | Bastos, Ishimoto, et al., 2006 | 30. m/0.25 mm/0.25 μm, 3. K/min; Tstart: 60. C; Tend: 220. C |
Capillary | SPB-1 | 1100. | Blagojevic, Radulovic, et al., 2006 | 30. m/0.25 mm/0.25 μm, He, 50. C @ 3. min, 5. K/min, 250. C @ 15. min |
Capillary | DB-5 | 1090. | Blagojevic, Radulovic, et al., 2006 | 30. m/0.2 mm/0.25 μm, He, 50. C @ 3. min, 5. K/min, 250. C @ 15. min |
Capillary | BP-1 | 1070. | Bousmaha, Boti, et al., 2006 | 50. m/0.25 mm/0.25 μm, He, 2. K/min, 220. C @ 20. min; Tstart: 60. C |
Capillary | DB-5 | 1093. | Dob, Dahmane, et al., 2006 | 30. m/0.32 mm/0.25 μm, N2, 60. C @ 3. min, 3. K/min, 240. C @ 5. min |
Capillary | DB-1 | 1080. | Kuiate, Bessière, et al., 2006 | 30. m/0.25 mm/0.25 μm, N2, 4. K/min; Tstart: 50. C; Tend: 220. C |
Capillary | HP-1 | 1070. | Nath, Baruah, et al., 2006 | 25. m/0.2 mm/0.33 μm, He, 60. C @ 3. min, 5. K/min, 300. C @ 30. min |
Capillary | DB-1 | 1092. | Osorio, Alarcon, et al., 2006 | 25. m/0.2 mm/0.33 μm, 4. K/min; Tstart: 50. C; Tend: 300. C |
Capillary | DB-1 | 1071. | Ramezani, Behravan, et al., 2006 | 30. m/0.25 mm/0.25 μm, He, 2.5 K/min; Tstart: 50. C; Tend: 265. C |
Capillary | SPB-1 | 1070. | Salgueiro L.R., Pinto E., et al., 2006 | 30. m/0.2 mm/0.2 μm, He, 3. K/min, 220. C @ 15. min; Tstart: 70. C |
Capillary | HP-5MS | 1087. | Saroglou, Dorizas, et al., 2006 | 30. m/0.25 mm/0.25 μm, He, 60. C @ 5. min, 4. K/min; Tend: 280. C |
Capillary | DB-5 | 1073. | Su, Ho, et al., 2006 | 30. m/0.25 mm/0.25 μm, He, 50. C @ 2. min, 5. K/min; Tend: 250. C |
Capillary | DB-1 | 1083. | Agnaniet, Makani, et al., 2005 | 30. m/0.25 mm/0.25 μm, N2, 5. K/min; Tstart: 50. C; Tend: 200. C |
Capillary | SE-54 | 1074. | Brantner, Pfeifhofer, et al., 2005 | 50. m/0.25 mm/0.27 μm, H2, 5. K/min; Tstart: 50. C; Tend: 300. C |
Capillary | DB-1 | 1071. | Dob, Berramdane, et al., 2005 | 30. m/0.32 mm/0.25 μm, N2, 50. C @ 3. min, 2. K/min, 260. C @ 5. min |
Capillary | DB-1 | 1071. | bin Jantan, Yalvema, et al., 2005 | 25. m/0.25 mm/0.25 μm, 60. C @ 10. min, 3. K/min, 180. C @ 10. min |
Capillary | DB-5 | 1071. | bin Jantan, Yalvema, et al., 2005, 2 | 25. m/0.25 mm/0.25 μm, N2, 75. C @ 10. min, 3. K/min, 210. C @ 1. min |
Capillary | HP-5 | 1071. | Javidnia, Miri, et al., 2005 | 30. m/0.25 mm/0.25 μm, He, 3. K/min; Tstart: 60. C; Tend: 260. C |
Capillary | HP-5MS | 1069. | Aligiannis, Kalpoutzakis, et al., 2004 | 30. m/0.25 mm/0.25 μm, He, 3. K/min; Tstart: 60. C; Tend: 280. C |
Capillary | SPB-1 | 1066. | Antunes, Sevinate-Pinto, et al., 2004 | 30. m/0.25 mm/0.25 μm, He, 3. K/min, 220. C @ 15. min; Tstart: 70. C |
Capillary | HP-1 | 1064. | Fernández-Ocaña, Gómez-Rodríguez, et al., 2004 | 25. m/0.32 mm/0.17 μm, He, 3. K/min; Tstart: 50. C; Tend: 200. C |
Capillary | HP-5 | 1091. | Flach A., Dondon R.C., et al., 2004 | 30. m/0.25 mm/0.25 μm, He, 4. K/min; Tstart: 50. C; Tend: 290. C |
Capillary | HP-5 | 1072. | Javidnia, Miri, et al., 2004 | 30. m/0.25 mm/0.25 μm, He, 3. K/min; Tstart: 60. C; Tend: 260. C |
Capillary | HP-5 | 1070. | Javidnia, Miri, et al., 2004, 2 | He, 3. K/min; Column length: 30. m; Column diameter: 0.25 mm; Tstart: 60. C; Tend: 260. C |
Capillary | DB-5 | 1074. | Javidnia, Miri, et al., 2004, 3 | 30. m/0.25 mm/0.25 μm, He, 3. K/min; Tstart: 60. C; Tend: 260. C |
Capillary | SPB-1 | 1070. | Moldão-Martins, Beirão-da-Costa, et al., 2004 | 30. m/0.2 mm/0.2 μm, He, 3. K/min, 220. C @ 15. min; Tstart: 70. C |
Capillary | RSL-200 | 1087. | Ngassoum, Ousmaila, et al., 2004 | 30. m/0.32 mm/0.25 μm, H2, 40. C @ 5. min, 6. K/min, 280. C @ 5. min |
Capillary | SPB-5 | 1089. | Pino, Marbot, et al., 2004 | 30. m/0.25 mm/0.25 μm, He, 60. C @ 2. min, 4. K/min, 250. C @ 20. min |
Capillary | BP-1 | 1072. | Raina, Kumar, et al., 2004 | 30. m/0.32 mm/0.25 μm, N2, 5. K/min, 220. C @ 13. min; Tstart: 60. C |
Capillary | DB-5 | 1083. | Reis, Pansarim, et al., 2004 | 30. m/0.25 mm/0.25 μm, He, 4. K/min; Tstart: 50. C; Tend: 290. C |
Capillary | HP-5MS | 1088. | Salido, Valenzuela, et al., 2004 | 30. m/0.25 mm/0.25 μm, He, 3. K/min; Tstart: 50. C; Tend: 250. C |
Capillary | BP-1 | 1070. | Tam, Thuam, et al., 2004 | 50. m/0.22 mm/0.25 μm, He, 2. K/min, 220. C @ 20. min; Tstart: 60. C |
Capillary | DB-5 | 1090. | bin Ahmad and bin Jantan, 2003 | 25. m/0.25 mm/0.25 μm, N2, 75. C @ 10. min, 3. K/min, 210. C @ 1. min |
Capillary | DB-5 | 1088. | bin Jantan, Yassin, et al., 2003 | 30. m/0.25 mm/0.25 μm, N2, 75. C @ 10. min, 3. K/min; Tend: 230. C |
Capillary | DB-5 | 1072. | Javidnia, Miri, et al., 2003 | He, 4. K/min; Column length: 25. m; Column diameter: 0.25 mm; Tstart: 60. C; Tend: 260. C |
Capillary | HP-5MS | 1091. | Lalel, Singh, et al., 2003 | 60. m/0.25 mm/0.25 μm, He, 40. C @ 1. min, 3. K/min, 310. C @ 20. min |
Capillary | CP Sil 5 CB | 1056. | Pino, Almora, et al., 2003 | 60. m/0.32 mm/0.25 μm, He, 60. C @ 10. min, 3. K/min, 280. C @ 60. min |
Capillary | SPB-5 | 1088. | Pino, Marbot, et al., 2003 | 30. m/0.25 mm/0.25 μm, He, 60. C @ 2. min, 4. K/min, 250. C @ 20. min |
Capillary | Mega 5MS | 1094. | Verzera, Trozzi, et al., 2003 | 30. m/0.25 mm/0.25 μm, He, 40. C @ 2. min, 3. K/min; Tend: 240. C |
Capillary | DB-5 | 1075. | Javidnia, Miri, et al., 2002 | He, 4. K/min; Column length: 25. m; Column diameter: 0.25 mm; Tstart: 70. C; Tend: 275. C |
Capillary | DB-5 | 1074. | Javidnia, Miri, et al., 2002, 2 | 30. m/0.25 mm/0.25 μm, He, 4. K/min; Tstart: 60. C; Tend: 260. C |
Capillary | RTX-5 | 1088. | Mondello, Zappia, et al., 2002 | 30. m/0.25 mm/0.25 μm, He, 45. C @ 6. min, 3. K/min, 300. C @ 10. min |
Capillary | CP Sil 5 CB | 1055. | Pino, Marbot, et al., 2002 | 30. m/0.25 mm/0.25 μm, H2, 60. C @ 10. min, 2. K/min, 280. C @ 40. min |
Capillary | CP Sil 5 CB | 1055. | Pino, Marbot, et al., 2002, 2 | 50. m/0.32 mm/0.4 μm, He, 60. C @ 10. min, 3. K/min, 280. C @ 60. min |
Capillary | DB-1 | 1073. | Pintore, Usai, et al., 2002 | 50. m/0.22 mm/0.25 μm, He, 2. K/min, 220. C @ 20. min; Tstart: 60. C |
Capillary | HP-5 | 1065. | Pitarokili, Couladis, et al., 2002 | 30. m/0.25 mm/0.25 μm, He, 3. K/min; Tstart: 60. C; Tend: 280. C |
Capillary | RTX-5 | 1088. | Shellie, Mondello, et al., 2002 | 30. m/0.25 mm/0.25 μm, He, 45. C @ 6. min, 3. K/min; Tend: 250. C |
Capillary | RTX-5 | 1088. | Shellie, Mondello, et al., 2002 | 30. m/0.25 mm/0.25 μm, He, 45. C @ 6. min, 3. K/min; Tend: 250. C |
Capillary | BP-1 | 1072. | Lota, Serra, et al., 2001 | 50. m/0.22 mm/0.25 μm, He, 2. K/min; Tstart: 60. C; Tend: 220. C |
Capillary | HP-5MS | 1088. | Salido, Altarejos, et al., 2001 | 30. m/0.25 mm/0.25 μm, He, 3. K/min; Tstart: 50. C; Tend: 250. C |
Capillary | HP-5 | 1088. | Alonzo, Bosco, et al., 2000 | 30. m/0.20 mm/0.25 μm, He, 60. C @ 8. min, 4. K/min, 180. C @ 2. min |
Capillary | SPB-1 | 1054. | Chen, Huang, et al., 1998 | 60. m/0.32 mm/0.25 μm, N2, 4. K/min, 200. C @ 20. min; Tstart: 40. C |
Capillary | BP-1 | 1076. | Tam, An, et al., 1998 | 50. m/0.22 mm/0.25 μm, He, 2. K/min, 220. C @ 20. min; Tstart: 60. C |
Capillary | DB-5 | 1082. | Sakho, Chassagne, et al., 1997 | H2, 60. C @ 3. min, 2. K/min; Column length: 30. m; Column diameter: 0.25 mm; Tend: 220. C |
Capillary | Methyl Silicone | 1080. | Píry, Príbela, et al., 1995 | 25. m/0.2 mm/0.3 μm, He, 2. K/min; Tstart: 40. C; Tend: 200. C |
Capillary | DB-1 | 1082. | Combariza, Tirado, et al., 1994 | 60. m/0.25 mm/0.25 μm, He, 70. C @ 5. min, 2.5 K/min, 250. C @ 15. min |
Capillary | HP-101 | 1089. | Chung, Eiserich, et al., 1993 | N2, 3. K/min; Column length: 50. m; Column diameter: 0.25 mm; Tstart: 70. C; Tend: 200. C |
Capillary | OV-101 | 1076. | Yang, Sugisawa, et al., 1992 | N2, 2. K/min; Column length: 50. m; Column diameter: 0.25 mm; Tstart: 80. C; Tend: 200. C |
Capillary | OV-101 | 1076. | Yang, Sugisawa, et al., 1992 | N2, 2. K/min; Column length: 50. m; Column diameter: 0.25 mm; Tstart: 80. C; Tend: 200. C |
Capillary | RSL-150 | 1061. | Sagrero-Nieves, de Pooter, et al., 1989 | 30. m/0.53 mm/1.2 μm, He, 3. K/min; Tstart: 30. C; Tend: 220. C |

Van Den Dool and Kratz RI, non-polar column, custom temperature program

Column type | Active phase | I | Reference | Comment |
---|---|---|---|---|
Capillary | BPX-5 | 1090. | Dharmawan, Kasapis, et al., 2007 | 30. m/0.25 mm/0.25 μm, He; Program: 35C => 4C/min => 200C => 30C/min => 300C (3min) |
Capillary | HP-5MS | 1091. | Pérez, Navarro, et al., 2007 | 30. m/0.25 mm/0.25 μm, He; Program: 50C(4min) => 10C/min => 200C(0.5min) => 20C/min => 260C(5min) |
Capillary | BPX-5 | 1080. | Cardeal, da Silva, et al., 2006 | 30. m/0.25 mm/0.25 μm; Program: 35C(5min) => 3C/min => 210C => 40C/min => 240C (4min) |
Capillary | DB-5 | 1086. | Sampaio and Nogueira, 2006 | 30. m/0.25 mm/0.25 μm; Program: 40C(2min) => 4C/min => 220C => 20C/min => 280C |
Capillary | HP-5 | 1072. | Gopanraj, Dan, et al., 2005 | 30. m/0.32 mm/0.25 μm, He, Chromosorb W; Program: 80 0C 8 K/min -> 150 0C 5 K/min -> 230 0C (10 min) |
Capillary | SPB-1 | 1071. | Sanz, Soria, et al., 2004 | 27. m/0.25 mm/0.25 μm, He; Program: 60C => 3C/min => 180C => 8C/min => 250C (5min) |
Capillary | DB-5MS | 1081. | Boulanger and Crouzet, 2001 | 30. m/0.25 mm/0.25 μm, H2; Program: 40C (5min) => 2C/min => 200C => 5C/min => 250C (15min) |
Capillary | SE-52 | 1084. | Lorenzo, Dellacassa, et al., 2001 | 25. m/0.32 mm/0.40 μm, H2; Program: 60 0C (8 min) 3 K/min -> 180 0C 20 K/min -> 250 0C (10 min) |
Capillary | DB-5MS | 1081. | Boulanger and Crouzet, 2000 | 30. m/0.25 mm/0.25 μm, He; Program: 60 0C (3 min) 2 K/min -> 220 0C 5 K/min -> 250 0C (15 min) |
Capillary | DB-5MS | 1082. | Boulanger and Crouzet, 2000, 2 | 30. m/0.25 mm/0.25 μm, H2/N2; Program: 40C (5min) => 2C/min => 200C => 5C/min => 250C (15min) |
Capillary | DB-5 | 1082. | Boulanger, Chassagne, et al., 1999 | 30. m/0.25 mm/0.25 μm, H2; Program: 40C(5min) => 2C/min => 220C => 5C/min => 250C(15min) |
Capillary | DB-5 | 1088. | Boulanger, Chassagne, et al., 1999 | 30. m/0.25 mm/0.25 μm, H2; Program: 40C(5min) => 2C/min => 220C => 5C/min => 250C(15min) |
Capillary | DB-5 | 1083. | Boulanger, Chassagne, et al., 1999 | 30. m/0.25 mm/0.25 μm, H2; Program: 40C(5min) => 2C/min => 220C => 5C/min => 250C(15min) |
Capillary | DB-5 | 1088. | Boulanger, Chassagne, et al., 1999 | 30. m/0.25 mm/0.25 μm, H2; Program: 40C(5min) => 2C/min => 220C => 5C/min => 250C(15min) |
Capillary | SE-52 | 1088. | Mondello, Dugo, et al., 1995 | 60. m/0.32 mm/0.40 μm, He; Program: 45 C (6 min) 3 C/min -> 111 0C 2 C/min -> 160 C 3 C/min -> 300 C (15 min) |
Capillary | HP-1 | 1082. | Sing, Smadja, et al., 1992 | 50. m/0.32 mm/1.05 μm, He; Program: 20C(0.5min) => 60C => 4C/min => 250C |

Van Den Dool and Kratz RI, polar column, temperature ramp

Column type | Active phase | I | Reference | Comment |
---|---|---|---|---|
Capillary | DB-Wax | 1484. | Cho, Namgung, et al., 2008 | 30. m/0.25 mm/0.25 μm, He, 40. C @ 1. min, 4. K/min, 200. C @ 10. min |
Capillary | BP-20 | 1467. | Bousmaha, Boti, et al., 2006 | 50. m/0.25 mm/0.25 μm, He, 2. K/min, 220. C @ 20. min; Tstart: 60. C |
Capillary | DB-Wax | 1483. | Cho, Choi, et al., 2006 | 60. m/0.25 mm/0.25 μm, He, 40. C @ 1. min, 4. K/min, 200. C @ 10. min |
Capillary | DB-Wax | 1484. | Cho, Choi, et al., 2006 | 60. m/0.25 mm/0.25 μm, He, 40. C @ 1. min, 4. K/min, 200. C @ 10. min |
Capillary | DB-Wax | 1455. | Osorio, Alarcon, et al., 2006 | 30. m/0.25 mm/0.25 μm, He, 50. C @ 4. min, 4. K/min, 220. C @ 20. min |
Capillary | Supelcowax-10 | 1466. | Salgueiro L.R., Pinto E., et al., 2006 | 30. m/0.2 mm/0.2 μm, He, 3. K/min, 220. C @ 15. min; Tstart: 70. C |
Capillary | ZB-Wax | 1443. | Ugliano, Bartowsky, et al., 2006 | 30. m/0.25 mm/0.25 μm, He, 50. C @ 1. min, 4. K/min, 220. C @ 10. min |
Capillary | OV-351 | 1450. | Bonvehí, 2005 | 50. m/0.32 mm/0.2 μm, He, 5. K/min; Tstart: 60. C; Tend: 220. C |
Capillary | DB-Wax | 1478. | Choi, 2005 | 60. m/0.25 mm/0.25 μm, N2, 70. C @ 2. min, 2. K/min, 230. C @ 20. min |
Capillary | Carbowax 20M | 1450. | Verzera, Campisi, et al., 2005 | 60. m/0.25 mm/0.25 μm, He, 45. C @ 0.17 min, 2. K/min; Tend: 250. C |
Capillary | ZB-Wax | 1427. | Ledauphin, Saint-Clair, et al., 2004 | 30. m/0.25 mm/0.15 μm, He, 35. C @ 10. min, 1.8 K/min, 220. C @ 10. min |
Capillary | DB-Wax Etr | 1429. | Ménager, Jost, et al., 2004 | 30. m/0.25 mm/0.25 μm, He, 40. C @ 3. min, 3. K/min, 245. C @ 20. min |
Capillary | BP-20 | 1461. | Tam, Thuam, et al., 2004 | 50. m/0.22 mm/0.25 μm, He, 2. K/min, 220. C @ 20. min; Tstart: 60. C |
Capillary | DB-Wax | 1438. | Aubert, Ambid, et al., 2003 | 30. m/0.32 mm/0.5 μm, 40. C @ 3. min, 3. K/min, 245. C @ 20. min |
Capillary | DB-Wax | 1478. | Choi, 2003 | 60. m/0.25 mm/0.25 μm, N2, 70. C @ 2. min, 2. K/min, 230. C @ 20. min |
Capillary | AT-Wax | 1425. | Pino, Almora, et al., 2003 | 60. m/0.32 mm/0.25 μm, He, 65. C @ 10. min, 2. K/min, 250. C @ 60. min |
Capillary | RTX-Wax | 1451. | Mondello, Zappia, et al., 2002 | 30. m/0.25 mm/0.25 μm, He, 45. C @ 6. min, 3. K/min, 250. C @ 10. min |
Capillary | Supelcowax-10 | 1437. | Moreira, Trugo, et al., 2002 | 30. m/0.25 mm/0.25 μm, He, 3. K/min, 230. C @ 30. min; Tstart: 50. C |
Capillary | AT-Wax | 1425. | Pino, Marbot, et al., 2002, 2 | 60. m/0.32 mm/0.25 μm, He, 65. C @ 10. min, 2. K/min, 250. C @ 60. min |
Capillary | BP-20 | 1469. | Pintore, Usai, et al., 2002 | 50. m/0.22 mm/0.25 μm, 2. K/min, 220. C @ 20. min; Tstart: 60. C |
Capillary | RTX-Wax | 1460. | Shellie, Mondello, et al., 2002 | 30. m/0.25 mm/0.25 μm, He, 45. C @ 6. min, 3. K/min; Tend: 250. C |
Capillary | RTX-Wax | 1460. | Shellie, Mondello, et al., 2002 | 30. m/0.25 mm/0.25 μm, He, 45. C @ 6. min, 3. K/min; Tend: 250. C |
Capillary | BP-20 | 1464. | Lota, Serra, et al., 2001 | 50. m/0.22 mm/0.25 μm, He, 2. K/min; Tstart: 60. C; Tend: 220. C |
Capillary | DB-Wax | 1443.5 | Pet'ka, Mocák, et al., 2001 | 30. m/0.32 mm/0.25 μm, H2, 35. C @ 0.5 min, 4. K/min; Tend: 220. C |
Capillary | CP-Wax 52CB | 1450. | Verzera, Campisi, et al., 2001 | 60. m/0.25 mm/0.25 μm, He, 45. C @ 0.17 min, 2. K/min; Tend: 250. C |
Capillary | DB-Wax | 1439. | Wirth, Guo, et al., 2001 | 30. m/0.32 mm/0.5 μm, He, 60. C @ 3. min, 3. K/min, 245. C @ 20. min |
Capillary | DB-Wax | 1446. | Bureau, Razungles, et al., 2000 | 30. m/0.32 mm/0.5 μm, 60. C @ 3. min, 3. K/min, 245. C @ 20. min |
Capillary | DB-Wax | 1482. | Choi and Sawamura, 2000 | 60. m/0.25 mm/0.25 μm, N2, 70. C @ 2. min, 2. K/min, 230. C @ 20. min |
Capillary | DB-Wax | 1448. | Shimoda, Wu, et al., 1996 | 60. m/0.25 mm/0.25 μm, He, 3. K/min; Tstart: 50. C; Tend: 230. C |
Capillary | Carbowax 20M | 1460. | Mondello, Dugo, et al., 1995 | 60. m/0.32 mm/0.425 μm, He, 45. C @ 3. min, 3. K/min, 300. C @ 20. min |
Capillary | Carbowax 20M | 1450. | Píry, Príbela, et al., 1995 | 50. m/0.2 mm/0.2 μm, He, 30. C @ 2. min, 4. K/min, 170. C @ 20. min |
Capillary | DB-Wax | 1432. | Shimoda, Shigematsu, et al., 1995 | 60. m/0.25 mm/0.25 μm, 2. K/min; Tstart: 50. C; Tend: 230. C |
Capillary | DB-Wax | 1451. | Combariza, Tirado, et al., 1994 | 60. m/0.25 mm/0.25 μm, He, 50. C @ 10. min, 2. K/min, 150. C @ 20. min |
Capillary | HP-20M | 1449. | Chung, Eiserich, et al., 1993 | He, 3. K/min; Column length: 50. m; Column diameter: 0.25 mm; Tstart: 60. C; Tend: 190. C |
Capillary | HP-FFAP | 1449. | Chung, Eiserich, et al., 1993 | He, 3. K/min; Column length: 50. m; Column diameter: 0.25 mm; Tstart: 60. C; Tend: 210. C |
Capillary | DB-Wax | 1461. | Umano, Hagi, et al., 1992 | He, 40. C @ 10. min, 2. K/min; Column length: 30. m; Column diameter: 0.25 mm; Tend: 200. C |
Capillary | DB-Wax | 1465. | Humpf and Schreier, 1991 | 30. m/0.25 mm/0.25 μm, He, 50. C @ 3. min, 4. K/min, 220. C @ 20. min |
Capillary | DB-Wax | 1461. | Krammer, Winterhalter, et al., 1991 | 30. m/0.25 mm/0.25 μm, He, 50. C @ 3. min, 4. K/min; Tend: 240. C |
Capillary | Carbowax 20M | 1451. | Suárez and Duque, 1991 | 2. K/min; Column length: 25. m; Column diameter: 0.31 mm; Tstart: 50. C; Tend: 200. C |
Capillary | Carbowax 20M | 1460. | Suárez and Duque, 1991 | 2. K/min; Column length: 25. m; Column diameter: 0.31 mm; Tstart: 50. C; Tend: 200. C |
Capillary | DB-Wax | 1459. | Fröhlich, Duque, et al., 1989 | 30. m/0.25 mm/0.25 μm, He, 50. C @ 3. min, 4. K/min; Tend: 250. C |
Capillary | DB-Wax | 1461. | Fröhlich, Duque, et al., 1989 | 30. m/0.25 mm/0.25 μm, He, 50. C @ 3. min, 4. K/min; Tend: 250. C |
Capillary | Carbowax 20M | 1461. | Schwab, Mahr, et al., 1989 | 30. m/0.25 mm/0.25 μm, He, 40. C @ 3. min, 4. K/min; Tend: 240. C |
Capillary | Carbowax 20M | 1464. | Chen and Ho, 1988 | He, 1.5 K/min, 225. C @ 80. min; Column length: 60. m; Column diameter: 0.32 mm; Tstart: 50. C |
Capillary | Carbowax 20M | 1457. | Chen, Kuo, et al., 1986 | He, 50. C @ 5. min, 2. K/min, 200. C @ 40. min; Column length: 50. m; Column diameter: 0.32 mm |

Van Den Dool and Kratz RI, polar column, custom temperature program

Column type | Active phase | I | Reference | Comment |
---|---|---|---|---|
Capillary | DB-Wax | 1439. | Selli, Canbas, et al., 2006 | 30. m/0.32 mm/0.5 μm, H2; Program: 60C(3min) => 2C/min => 220C => 3C/min => 245C (20min) |
Capillary | SOLGel-Wax | 1430. | Aubert, Baumann, et al., 2005 | 30. m/0.25 mm/0.25 μm, He; Program: 35C(5min) => 3C/min => 150C => 5C/min => 250C (10min) |
Capillary | Carbowax 20M | 1449. | Boido, Lloret, et al., 2003 | 25. m/0.32 mm/0.25 μm, H2; Program: 40C (8min) => 3C/min => 180C => 20C/min => 230C |
Capillary | DB-Wax | 1458. | Boulanger and Crouzet, 2001 | 30. m/0.25 mm/0.25 μm, H2; Program: 60C (3min) => 2C/min => 220C => 5C/min => 250C (15min) |
Capillary | DB-Wax | 1461. | Cantergiani, Brevard, et al., 2001 | 30. m/0.25 mm/0.25 μm; Program: 20C(30s) => fast => 60C => 4C/min => 220C (20min) |
Capillary | DB-Wax | 1459. | Boulanger and Crouzet, 2000 | 30. m/0.25 mm/0.25 μm, H2; Program: 60 0C (3 min) 2 K/min -> 220 0C 5 K/min -> 250 0C (15 min) |
Capillary | DB-Wax | 1457. | Boulanger and Crouzet, 2000, 2 | 30. m/0.25 mm/0.25 μm, H2; Program: 60C(3min) => 2C/min => 220C => 5C/min => 250C (15min) |
Capillary | Supelcowax-10 | 1475. | Sing, Smadja, et al., 1992 | 60. m/0.25 mm/0.25 μm, He; Program: 20C(0.5min) => 60C => 4C/min => 250C |

Normal alkane RI, non-polar column, temperature ramp

Column type | Active phase | I | Reference | Comment |
---|---|---|---|---|
Capillary | HP-5 MS | 1081. | Pripdeevech and Saansoomchai, 2013 | 30. m/0.25 mm/0.25 μm, Helium, 3. K/min; Tstart: 60. C; Tend: 230. C |
Capillary | HP-5 | 1094. | Radulovic, Dordevic, et al., 2010 | 30. m/0.25 mm/0.25 μm, Hydrogen, 5. K/min; Tstart: 70. C; Tend: 290. C |
Capillary | DB-1-MS | 1057. | Takeoka, Hobbs, et al., 2010 | 60. m/0.25 mm/0.25 μm, Helium, 30. C @ 4. min, 2. K/min, 200. C @ 35. min |
Capillary | DB-5 | 1086. | Porto, Decorti, et al., 2009 | 30. m/0.25 mm/0.25 μm, Helium, 45. C @ 3. min, 3. K/min, 250. C @ 5. min |
Capillary | HP-5MS | 1088. | Wannes, Mhamdi, et al., 2009 | 30. m/0.25 mm/0.25 μm, Helium, 5. K/min; Tstart: 50. C; Tend: 240. C |
Capillary | DB-5 | 1087. | Bastos, Ishimoto, et al., 2008 | 30. m/0.25 mm/0.25 μm, Helium, 3. K/min; Tstart: 60. C; Tend: 220. C |
Capillary | HP-5 MS | 1085. | Sahraoui, Vian, et al., 2008 | 30. m/0.25 mm/0.25 μm, Helium, 60. C @ 8. min, 2. K/min, 250. C @ 15. min |
Capillary | HP-5MS | 1085. | Ferhat, Tigrine-Kordjani, et al., 2007 | 30. m/0.25 mm/0.25 μm, He, 60. C @ 8. min, 2. K/min, 250. C @ 15. min |
Capillary | ZP-5 | 1099. | Füssel, Dötterl, et al., 2007 | 60. m/0.25 mm/0.25 μm, He, 40. C @ 7. min, 6. K/min, 260. C @ 1. min |
Capillary | CP Sil 5 CB | 1060. | Hnawia, Cabalion, et al., 2007 | 30. m/0.25 mm/0.25 μm, N2, 5. K/min; Tstart: 50. C; Tend: 200. C |
Capillary | DB-5 | 1074. | Machado, Bastos, et al., 2007 | 30. m/0.25 mm/0.25 μm, He, 3. K/min; Tstart: 40. C; Tend: 240. C |
Capillary | DB-5 | 1086. | Machado, Bastos, et al., 2007 | 30. m/0.25 mm/0.25 μm, He, 3. K/min; Tstart: 40. C; Tend: 240. C |
Capillary | RTX-5 | 1092. | Setkova, Risticevic, et al., 2007 | 10. m/0.18 mm/0.2 μm, He, 40. C @ 0.5 min, 50. K/min, 275. C @ 0.5 min |
Capillary | DB-5 | 1078. | Tiwary, Nail, et al., 2007 | Helium, 2. K/min, 200. C @ 20. min; Column length: 30. m; Column diameter: 0.25 mm; Tstart: 60. C |
Capillary | DB-5 | 1088. | Tiwary, Nail, et al., 2007 | Helium, 2. K/min, 200. C @ 20. min; Column length: 30. m; Column diameter: 0.25 mm; Tstart: 60. C |
Capillary | HP-5 MS | 1073. | Vagionas, Graikou, et al., 2007 | 30. m/0.25 mm/0.25 μm, Helium, 3. K/min; Tstart: 60. C; Tend: 280. C |
Capillary | HP-5 | 1086. | Bertrand, Comte, et al., 2006 | 60. m/0.25 mm/0.25 μm, He, 3. K/min; Tstart: 60. C; Tend: 250. C |
Capillary | HP-5MS | 1067. | Bozin, Mimicá-Dukic, et al., 2006 | 30. m/0.25 mm/0.25 μm, He, 3. K/min; Tstart: 60. C; Tend: 280. C |
Capillary | HP-1 | 1076. | Castel, Fernandez, et al., 2006 | 50. m/0.2 mm/0.5 μm, He, 2. K/min, 250. C @ 120. min; Tstart: 60. C |
Capillary | HP-5 | 1075. | Coronel, Cerda-Garcia-Rojas, et al., 2006 | 30. m/0.32 mm/0.25 μm, He, 3. K/min; Tstart: 60. C; Tend: 246. C |
Capillary | HP-1 | 1070. | Fernandez, Pintaric, et al., 2006 | 50. m/0.2 mm/0.33 μm, He, 2. K/min, 250. C @ 60. min; Tstart: 60. C |
Capillary | DB-5 | 1070. | Javidnia, Miri, et al., 2006 | 30. m/0.25 mm/0.25 μm, Helium, 3. K/min; Tstart: 60. C; Tend: 260. C |
Capillary | DB-1 | 1073. | Lan Phi N.T., Nishiyama C., et al., 2006 | 60. m/0.25 mm/0.25 μm, 70. C @ 2. min, 2. K/min, 230. C @ 20. min |
Capillary | CP Sil 5 CB | 1058. | Martin, Joseph, et al., 2006 | 30. m/0.25 mm/0.25 μm, N2, 5. K/min; Tstart: 50. C; Tend: 200. C |
Capillary | HP-5 MS | 1073. | Marzouk, Mansour, et al., 2006 | 30. m/0.25 mm/0.25 μm, Nitrogen, 5. K/min, 280. C @ 5. min; Tstart: 50. C |
Capillary | HP-5 | 1073. | Marzouk, Neffati, et al., 2006 | 30. m/0.25 mm/0.52 μm, N2, 5. K/min, 280. C @ 5. min; Tstart: 50. C |
Capillary | HP-101 | 1066. | Mastelic, Jerkovic, et al., 2006 | 25. m/0.2 mm/0.2 μm, He, 70. C @ 2. min, 3. K/min, 200. C @ 15. min |
Capillary | DB-5 | 1076. | Morteza-Semnani K., Saeedi M., et al., 2006 | 30. m/0.25 mm/0.25 μm, He, 60. C @ 5. min, 4. K/min; Tend: 220. C |
Capillary | NB-30 | 1076. | Orav, Raal, et al., 2006 | 30. m/0.2 mm/0.25 μm, He, 2. K/min; Tstart: 50. C; Tend: 250. C |
Capillary | DB-5 | 1086. | Ouamba, Ouabonzi, et al., 2006 | 25. m/0.25 mm/0.15 μm, N2, 50. C @ 3. min, 4. K/min; Tend: 200. C |
Capillary | SPB-5 | 1089. | Pino, Marquez, et al., 2006 | 30. m/0.25 mm/0.25 μm, Helium, 60. C @ 2. min, 4. K/min, 250. C @ 20. min |
Capillary | HP-5MS | 1069. | Sabulal, Dan, et al., 2006 | 30. m/0.32 mm/0.25 μm, He, 3. K/min; Tstart: 60. C; Tend: 243. C |
Capillary | DB-1 | 1074. | Sawamura, Onishi, et al., 2006 | 60. m/0.25 mm/0.25 μm, 70. C @ 2. min, 2. K/min, 230. C @ 20. min |
Capillary | DB-5 | 1088. | Senatore, Landolfi, et al., 2006 | 30. m/0.25 mm/0.25 μm, He, 40. C @ 5. min, 2. K/min, 260. C @ 20. min |
Capillary | HP-5MS | 1088. | Setzer, Noletto, et al., 2006 | 30. m/0.25 mm/0.25 μm, He, 60. C @ 5. min, 3. K/min; Tend: 280. C |
Capillary | SPB-5 | 1072. | Stojanovic, Palic, et al., 2006 | He, 50. C @ 3. min, 5. K/min, 250. C @ 15. min |
Capillary | HP-5 MS | 1085. | Tigrine-Kordiani, Meklati, et al., 2006 | 30. m/0.25 mm/0.25 μm, Helium, 60. C @ 8. min, 2. K/min, 250. C @ 15. min |
Capillary | SPB-1 | 1061. | Wong, Lim, et al., 2006 | 50. m/0.2 mm/0.33 μm, He, 50. C @ 1. min, 4. K/min, 220. C @ 10. min |
Capillary | DB-5 | 1095. | Chagonda and Chalchat, 2005 | 50. m/0.3 mm/0.25 μm, 2. K/min; Tstart: 60. C; Tend: 240. C |
Capillary | DB-1 | 1077. | Fakhari, Salehi, et al., 2005 | 60. m/0.25 mm/0.25 μm, He, 5. K/min; Tstart: 60. C; Tend: 250. C |
Capillary | HP-5MS | 1080. | Gauvin and Smadja, 2005 | 30. m/0.25 mm/0.25 μm, He, 60. C @ 30. min, 4. K/min; Tend: 200. C |
Capillary | SPB-5 | 1082. | Kilic, Kollmannsberger, et al., 2005 | He, 5. K/min; Column length: 30. m; Column diameter: 0.53 mm; Tstart: 100. C; Tend: 250. C |
Capillary | HP-5 | 1088.6 | Leffingwell and Alford, 2005 | 60. m/0.32 mm/0.25 μm, He, 30. C @ 2. min, 2. K/min, 260. C @ 28. min |
Capillary | DB-1 | 1063. | Nyegue, Belinga-Ndoye, et al., 2005 | 30. m/0.25 mm/0.25 μm, N2, 5. K/min; Tstart: 50. C; Tend: 200. C |
Capillary | DB-5 | 1079. | de Oliveira, Dias, et al., 2005 | He, 40. C @ 1. min, 4. K/min; Column length: 30. m; Column diameter: 0.25 mm; Tend: 220. C |
Capillary | DB-1 | 1077. | Palá-Paúl, Pérez-Alonso, et al., 2005 | 50. m/0.25 mm/0.25 μm, N2, 4. K/min; Tstart: 95. C; Tend: 240. C |
Capillary | RTX-5 MS | 1095. | Pellati, Benvenuti, et al., 2005 | 30. m/0.25 mm/0.25 μm, He, 50. C @ 2. min, 8. K/min, 280. C @ 2. min |
Capillary | HP-5MS | 1087. | Setzer, Noletto, et al., 2005 | 30. m/0.25 mm/0.25 μm, He, 60. C @ 5. min, 3. K/min; Tend: 280. C |
Capillary | DB-5MS | 1074. | da Silva, Andrade, et al., 2005 | 30. m/0.25 mm/0.25 μm, He, 3. K/min; Tstart: 60. C; Tend: 240. C |
Capillary | HP-5MS | 1088. | Slavkovska, Couladis, et al., 2005 | 30. m/0.25 mm/0.25 μm, He, 3. K/min; Tstart: 60. C; Tend: 280. C |
Capillary | CP Sil 8 CB | 1080. | Suárez, Vásquez, et al., 2005 | He, 60. C @ 5. min, 3. K/min; Column length: 30. m; Column diameter: 0.25 mm; Tend: 290. C |
Capillary | HP-5MS | 1088. | Tesevic, Nikicevic, et al., 2005 | 30. m/0.25 mm/0.25 μm, He, 4.3 K/min; Tstart: 60. C; Tend: 285. C |
Capillary | SPB-1 | 1054. | Wong and Tan, 2005 | 50. m/0.2 mm/0.33 μm, He, 50. C @ 3. min, 4. K/min, 220. C @ 30. min |
Capillary | ZB-5 | 1084. | Jürgens and Dötterl, 2004 | 60. m/0.25 mm/0.25 μm, He, 40. C @ 4.6 min, 6. K/min, 260. C @ 1. min |
Capillary | DB-5MS | 1089. | paz Lima, Silva, et al., 2004 | 30. m/0.25 mm/0.25 μm, He, 3. K/min; Tstart: 60. C; Tend: 240. C |
Capillary | DB-1 | 1054. | Park, Lee, et al., 2004 | 60. m/0.32 mm/0.25 μm, He, 35. C @ 4. min, 2. K/min, 230. C @ 25. min |
Capillary | DB-1 | 1054. | Park, Lee, et al., 2004 | 60. m/0.32 mm/0.25 μm, He, 35. C @ 4. min, 2. K/min, 230. C @ 25. min |
Capillary | DB-1 | 1056. | Park, Lee, et al., 2004 | 60. m/0.32 mm/0.25 μm, He, 35. C @ 4. min, 2. K/min, 230. C @ 25. min |
Capillary | NB-30 | 1076. | Raal, Arak, et al., 2004 | 50. m/0.2 mm/0.25 μm, He, 2. K/min; Tstart: 50. C; Tend: 250. C |
Capillary | HP-1 | 1074. | Senatore, Napolitano, et al., 2004 | 30. m/0.25 mm/0.33 μm, He, 40. C @ 5. min, 2. K/min, 260. C @ 20. min |
Capillary | HP-5 | 1092. | Shafi, Nambiar, et al., 2004 | 25. m/0.2 mm/0.5 μm, N2, 3. K/min; Tstart: 30. C; Tend: 280. C |
Capillary | HP-5 | 1073. | Simic, Sokovic, et al., 2004 | 25. m/0.32 mm/0.52 μm, H2, 4. K/min; Tstart: 40. C; Tend: 240. C |
Capillary | BPX-5 | 1101. | Vilaseca, Guy, et al., 2004 | 25. m/0.22 mm/1. μm, He, 60. C @ 5. min, 3. K/min, 250. C @ 10. min |
Capillary | DB-5 | 1087. | Woerdenbag, Windono, et al., 2004 | 30. m/0.249 mm/0.25 μm, He, 3. K/min; Tstart: 60. C; Tend: 300. C |
Capillary | OV-101 | 1070. | Agnaniet, Mounzeo, et al., 2003 | 25. m/0.25 mm/0.25 μm, N2, 5. K/min; Tstart: 50. C; Tend: 200. C |
Capillary | HP-5MS | 1086. | Ghannadi, Aghazari, et al., 2003 | 30. m/0.25 mm/0.25 μm, He, 4. K/min; Tstart: 60. C; Tend: 275. C |
Capillary | RSL-200 | 1080. | Jirovetz, Buchbauer, et al., 2003 | 30. m/0.32 mm/0.25 μm, H2, 40. C @ 5. min, 6. K/min, 280. C @ 5. min |
Capillary | RSL-200 | 1075. | Jirovetz, Buchbauer, et al., 2003, 2 | 30. m/0.32 mm/0.25 μm, H2, 40. C @ 5. min, 6. K/min, 280. C @ 5. min |
Capillary | SPB-5 | 1091. | Ledauphin, Guichard, et al., 2003 | 30. m/0.32 mm/0.25 μm, He, 40. C @ 1. min, 5. K/min, 220. C @ 20. min |
Capillary | HP-5 | 1088. | Mookdasanit, Tamura, et al., 2003 | Helium, 2. K/min, 210. C @ 60. min; Column length: 30. m; Column diameter: 0.32 mm; Tstart: 70. C |
Capillary | DB-5 | 1088. | Pino, Marbot, et al., 2003, 2 | 30. m/0.25 mm/0.25 μm, H2, 60. C @ 10. min, 4. K/min, 280. C @ 40. min |
Capillary | HP-5 | 1071. | Velickovic, Randjelovic, et al., 2003 | 25. m/0.32 mm/0.53 μm, H2, 4. K/min; Tstart: 40. C; Tend: 280. C |
Capillary | HP-5 | 1073. | Velickovic, Randjelovic, et al., 2003 | 25. m/0.32 mm/0.53 μm, H2, 4. K/min; Tstart: 40. C; Tend: 280. C |
Capillary | OV-101 | 1070. | Boyom, Keumedjio, et al., 2002 | 5. K/min; Column length: 25. m; Column diameter: 0.32 mm; Tstart: 50. C; Tend: 200. C |
Capillary | DB-5 | 1072. | Caredda, Marongiu, et al., 2002 | 30. m/0.25 mm/0.25 μm, He, 3. K/min, 280. C @ 30. min; Tstart: 60. C |
Capillary | DB-5 | 1092. | Lin, Rouseff, et al., 2002 | 30. m/0.32 mm/0.25 μm, He, 7. K/min; Tstart: 40. C; Tend: 290. C |
Capillary | OV-101 | 1072. | Orav, Kailas, et al., 2002 | 50. m/0.2 mm/0.5 μm, He, 2. K/min; Tstart: 50. C; Tend: 250. C |
Capillary | DB-5 | 1085. | Schwob, Bessière, et al., 2002 | He, 3. K/min; Column length: 25. m; Column diameter: 0.2 mm; Tstart: 60. C; Tend: 220. C |
Capillary | Optima-1 | 1079. | Brun, Bessière, et al., 2001 | 25. m/0.20 mm/0.25 μm, He, 50. C @ 3. min, 3. K/min; Tend: 250. C |
Capillary | DB-5MS | 1093. | Fernando and Grün, 2001 | 60. m/0.25 mm/0.25 μm, He, 35. C @ 5. min, 3. K/min; Tend: 250. C |
Capillary | BP-1 | 1076. | Gupta, Mallavarapu, et al., 2001 | 30. m/0.25 mm/0.25 μm, N2, 5. K/min; Tstart: 60. C; Tend: 220. C |
Capillary | OV-101 | 1076. | Yang, 2001 | N2, 2. K/min; Column length: 50. m; Column diameter: 0.25 mm; Tstart: 80. C; Tend: 200. C |
Capillary | OV-101 | 1076. | Yang, 2001, 2 | N2, 2. K/min; Column length: 50. m; Column diameter: 0.25 mm; Tstart: 80. C; Tend: 200. C |
Capillary | Optima-1 | 1079. | de Beck, Bessière, et al., 2000 | 25. m/0.20 mm/0.25 μm, He, 50. C @ 3. min, 3. K/min; Tend: 250. C |
Capillary | BP-1 | 1089. | Mohagheghzadeh, Shams-Ardakani, et al., 2000 | 25. m/0.33 mm/1.0 μm, N2, 4. K/min; Tstart: 60. C; Tend: 275. C |
Capillary | DB-5 | 1088. | Simic, Andjelkovic, et al., 2000 | 60. m/0.25 mm/0.30 μm, Hydrogen or helium (He2 wrote in original paper), 4.3 K/min; Tstart: 60. C; Tend: 285. C |
Capillary | OV-101 | 1077. | Menon, Chacko, et al., 1999 | N2, 1. K/min, 200. C @ 20. min; Column length: 50. m; Column diameter: 0.2 mm; Tstart: 80. C |
Capillary | HP-1 | 1065. | Ong and Acree, 1999 | 4. K/min; Column length: 25. m; Column diameter: 0.20 mm; Tstart: 35. C; Tend: 250. C |
Capillary | DB-1 | 1068. | Shafiee, Javidnia, et al., 1999 | He, 3. K/min, 230. C @ 5. min; Column length: 60. m; Column diameter: 0.32 mm; Tstart: 60. C |
Capillary | DB-5 | 1099. | Sun and Petracek, 1999 | H2, 32. C @ 5. min, 7. K/min, 260. C @ 5. min; Column length: 30. m; Column diameter: 0.32 mm |
Capillary | SE-30 | 1078. | Jantan, Ahmad, et al., 1998 | He, 60. C @ 10. min, 3. K/min; Column length: 25. m; Column diameter: 0.2 mm; Tend: 180. C |
Capillary | CBP-1 | 1071. | Lamarque, Maestri, et al., 1998 | He, 4. K/min; Column length: 30. m; Column diameter: 0.25 mm; Tstart: 60. C; Tend: 240. C |
Capillary | HP-1 | 1065. | Ong and Acree, 1998 | 4. K/min; Column length: 25. m; Column diameter: 0.32 mm; Tstart: 35. C; Tend: 250. C |
Capillary | HP-1 | 1065. | Ong, Acree, et al., 1998 | 4. K/min; Column length: 25. m; Column diameter: 0.32 mm; Tstart: 35. C; Tend: 250. C |
Capillary | BPX-5 | 1098. | D'Arcy, Rintoul, et al., 1997 | 50. m/0.22 mm/0.25 μm, He, 50. C @ 1. min, 3. K/min, 250. C @ 10. min |
Capillary | OV-101 | 1080. | Chacko, Jayalekshmy, et al., 1996 | 50. m/0.25 mm/0.17 μm, N2, 5. K/min; Tstart: 50. C; Tend: 220. C |
Capillary | SPB-1 | 1077. | Wong and Lai, 1996 | 50. m/0.2 mm/0.33 μm, He, 40. C @ 3. min, 3. K/min, 200. C @ 30. min |
Capillary | Methyl Silicone | 1082. | Gopalakrishnan, Menon, et al., 1993 | 50. m/0.25 mm/0.17 μm, N2, 2. K/min; Tstart: 80. C; Tend: 200. C |
Capillary | Methyl Silicone | 1082. | Gopalakrishnan, Menon, et al., 1993 | 50. m/0.25 mm/0.17 μm, N2, 3. K/min; Tstart: 80. C; Tend: 200. C |
Capillary | OV-101 | 1076. | Tamura, Yang, et al., 1993 | 2. K/min; Column length: 50. m; Column diameter: 0.25 mm; Tstart: 80. C; Tend: 200. C |
Capillary | OV-101 | 1076. | Tamura, Yang, et al., 1993 | 2. K/min; Column length: 50. m; Column diameter: 0.25 mm; Tstart: 80. C; Tend: 200. C |
Capillary | DB-1 | 1074. | Velasco-Negueruela, Pérez Alonso, et al., 1991 | N2, 4. K/min; Column length: 30. m; Tstart: 80. C; Tend: 220. C |
Capillary | DB-1 | 1056. | Buttery, Takeoka, et al., 1990 | 30. C @ 25. min, 4. K/min, 200. C @ 30. min; Column length: 60. m |
Capillary | OV-101 | 1078. | Yang and Sugisawa, 1990 | N2, 2. K/min; Column length: 50. m; Column diameter: 0.25 mm; Tstart: 80. C; Tend: 200. C |
Capillary | OV-101 | 1082. | Yang and Sugisawa, 1990 | N2, 2. K/min; Column length: 50. m; Column diameter: 0.25 mm; Tstart: 80. C; Tend: 200. C |
Capillary | OV-101 | 1082. | Sugisawa, Yamamoto, et al., 1989 | N2, 2. K/min; Column length: 50. m; Column diameter: 0.25 mm; Tstart: 80. C; Tend: 200. C |
Capillary | OV-101 | 1076. | Sugisawa, Yang, et al., 1989 | N2, 2. K/min; Column length: 50. m; Column diameter: 0.25 mm; Tstart: 80. C; Tend: 200. C |
Capillary | OV-101 | 1082. | Sugisawa, Yang, et al., 1989 | N2, 2. K/min; Column length: 50. m; Column diameter: 0.25 mm; Tstart: 80. C; Tend: 200. C |
Capillary | DB-5 | 1087. | Georgilopoulos and Gallois, 1988 | 30. m/0.35 mm/1.0 μm, Hydrogen, 2. K/min; Tstart: 45. C; Tend: 220. C |
Capillary | OV-101 | 1071. | Nykanen, 1986 | 40. C @ 5. min, 3.5 K/min; Column length: 50. m; Column diameter: 0.30 mm; Tend: 230. C |
Capillary | DB-1 | 1055. | Habu, Flath, et al., 1985 | 3. K/min; Column length: 50. m; Column diameter: 0.32 mm; Tstart: 0. C; Tend: 250. C |
Capillary | DB-1 | 1055. | Flath, Mon, et al., 1983 | 50. C @ 0.1 min, 4. K/min, 250. C @ 5. min; Column length: 60. m; Column diameter: 0.32 mm |
Capillary | SE-30 | 1100. | Alves and Jennings, 1979 | Helium, 2. K/min; Tstart: 70. C; Tend: 170. C |

Normal alkane RI, non-polar column, custom temperature program

Column type | Active phase | I | Reference | Comment |
---|---|---|---|---|
Capillary | CP-Sil 8 CB | 1088. | Di Giusto, Bessiere, et al., 2010 | 30. m/0.25 mm/0.25 μm, Helium; Program: Multi-rise program |
Capillary | DB-1-MS | 1056. | Takeoka, Hobbs, et al., 2010 | 60. m/0.25 mm/0.25 μm, Helium; Program: not specified |
Capillary | DB-5 | 1075. | Courtois, Paine, et al., 2009 | 30. m/0.25 mm/0.25 μm, Helium; Program: 50 0C m6 0C/min -> 140 0C 5 0C/min -> 160 0C (1 min) 10 0C/min -> 200 0C |
Capillary | DB-1 | 1064. | Delort and Jaquier, 2009 | 60. m/0.25 mm/0.25 μm, Helium; Program: 50 0C (5 min) 3 0C/min -> 120 0C 5 0C/min -> 250 0C (3 min) 15 0C/min -> 300 0C (20 min) |
Capillary | DB-5 | 1088. | Porto, Decorti, et al., 2009 | 30. m/0.25 mm/0.25 μm, Helium; Program: not specified |
Capillary | HP-5 | 1088. | Riahi, Pourbasheer, et al., 2009 | Column length: 30. m; Column diameter: 0.32 mm; Program: not specified |
Capillary | DB-5 | 1088. | Bastos, Ishimoto, et al., 2008 | 30. m/0.25 mm/0.25 μm, Helium; Program: not specified |
Capillary | CB-1 | 1066. | Kannaste, Vongvanich, et al., 2008 | 30. m/0.25 mm/0.25 μm, Helium; Program: 40 0C (2 min) 4 0C/min -> 180 0C 20 0C/min -> 220 0C (1 min) |
Capillary | CB-1 | 1058. | Kannaste, Vongvanich, et al., 2008 | 30. m/0.25 mm/0.25 μm, Helium; Program: not specified |
Capillary | CP Sil 8 CB | 1088. | Kristiawan, Sobolik, et al., 2008 | 30. m/0.25 mm/0.25 μm; Program: 60C => 2.5C/min => 170C => 10C/min => 250C (5min) |
Capillary | HP-5MS | 1074. | Ning, Zheng, et al., 2008 | 30. m/0.25 mm/0.25 μm, He; Program: 40 0C (2 min) 3 0C/min -> 180 0C (2 min) 15 0C -> 280 0C |
Capillary | HP-5 | 1090. | Zhao, Li, et al., 2008 | 30. m/0.25 mm/0.25 μm; Program: 40 0C (2 min) 5 0C/min -> 80 0C 7 oC/min -> 160 0C 9 0C/min -> 200 0C 20 0C/min -> 280 0C (10 min) |
Capillary | HP-5 | 1082. | Zhao, Li, et al., 2008 | 30. m/0.25 mm/0.25 μm; Program: not specified |
Capillary | DB-5 MS | 1084. | Zhu, Li, et al., 2008 | 30. m/0.25 mm/0.25 μm, Helium; Program: 50 0C (2.8 min) 5.5 0C/min -> 140 0C (1 min) 4.5 oC/min -> 220 0C -> 225 0C (2 min) 3.4 0C/min -> 265 0C (5 min) |
Capillary | DB-5 MS | 1085. | Zhu, Li, et al., 2008 | 30. m/0.25 mm/0.25 μm, Helium; Program: 50 0C (2.8 min) 5.5 0C/min -> 140 0C (1 min) 4.5 oC/min -> 220 0C -> 225 0C (2 min) 3.4 0C/min -> 265 0C (5 min) |
Capillary | HP-5MS | 1088. | Cole, Haber, et al., 2007 | 30. m/0.25 mm/0.25 μm, He; Program: 40C(10min) => 3C/min => 200C => 2C/min => 220C |
Capillary | DB-1 | 1059. | Kamatou, Viljoen, et al., 2007 | 30. m/0.25 mm/0.25 μm, H2; Program: 45 0C 3 0C/min -> 175 0C 15 0C/min -> 300 0C (10 min) |
Capillary | DB-5 | 1088. | Machado, Bastos, et al., 2007 | 30. m/0.25 mm/0.25 μm, He; Program: not specified |
Capillary | CP Sil 8 CB | 1088. | Meekijjaroenroj, Bessière, et al., 2007 | 30. m/0.25 mm/0.25 μm, He; Program: 50C(3min) => 3C/min => 100C => 2.7C/min => 140C => 2.4C/min => 180C => 6C/min => 250C |
Capillary | CP-Sil | 1090. | Proffit, 2007 | 30. m/0.25 mm/0.25 μm, Helium; Program: 50 0C (3 min) 3 0C/min -> 100 0C 2.7 0C/min -> 140 0C 2.4 0C/min -> 180 0C 6 0C/min -> 250 0C |
Capillary | BPX-5 | 1099. | Salamci, Kordali, et al., 2007 | 30. m/0.25 mm/0.25 μm, He; Program: 50C => 3C/min => 150C(10min) => 10C/min => 250C |
Capillary | HP-5 MS | 1085. | Schmidt, Noletto, et al., 2006 | 30. m/0.25 mm/0.25 μm, Helium; Program: 40 0C (10 min) 3 0C/min -> 200 0C 2 0C/min -> 220 0C |
Capillary | HP-5 MS | 1085. | Schmidt, Noletto, et al., 2006 | 30. m/0.25 mm/0.25 μm, Helium; Program: 40 0C (10 min) 3 0C/min -> 200 0C 2 0C/min -> 220 0C |
Capillary | HP-5 MS | 1085. | Schmidt, Noletto, et al., 2006 | 30. m/0.25 mm/0.25 μm, Helium; Program: 40 0C (10 min) 3 0C/min -> 200 0C 2 0C/min -> 220 0C |
Capillary | HP-5MS | 1088. | Singh G., Maurya S., et al., 2006 | 30. m/0.32 mm/0.25 μm, He; Program: 60C(1min) => 1.5C => 185C => 9C/min => 275C (2min) |
Capillary | DB-5 | 1088. | de Oliveira, Dias, et al., 2005 | He; Column length: 30. m; Column diameter: 0.25 mm; Program: not specified |
Capillary | DB-1 | 1059. | Miguel, Simões, et al., 2004 | 30. m/0.25 mm/0.25 μm, He; Program: 45C => 3C/min => 175C => 15C/min => 300C (10min) |
Capillary | HP-5MS | 1073. | Sahin, Gulluce, et al., 2004 | 30. m/0.25 mm/0.25 μm, He; Program: 50C(3min) => 3C/min => 150C(10min) => 10C/min => 250C |
Capillary | DB-5 | 1088. | Vilaseca, Guy, et al., 2004 | Program: not specified |
Capillary | SE-30 | 1082. | Vinogradov, 2004 | Program: not specified |
Capillary | DB-1 | 1060. | Silva, Matos, et al., 2003 | 30. m/0.25 mm/0.1 μm, He; Program: 35C => 4C/min => 180C => 10C/min => 250C |
Capillary | DB-1 | 1059. | Figueiredo, Miguel, et al., 2001 | 30. m/0.25 mm/0.25 μm; Program: 45 0C 3 K/min -> 175 0C 15 K/min -> 300 0C (10 min) |
Capillary | OV-101 | 1076. | Yang, 2001 | N2; Column length: 50. m; Column diameter: 0.25 mm; Program: not specified |
Capillary | CP Sil 5 CB | 1061. | Weyerstahl, Marschall, et al., 1999 | Column length: 25. m; Column diameter: 0.39 mm; Program: not specified |
Capillary | CP Sil 5 CB | 1060. | Weyerstahl, Marschall, et al., 1998 | He; Column length: 25. m; Phase thickness: 0.39 μm; Program: not specified |
Capillary | CP Sil 5 CB | 1061. | Weyerstahl, Marschall, et al., 1998, 2 | N2; Column length: 25. m; Phase thickness: 0.39 μm; Program: not specified |
Capillary | DB-5 | 1089. | Anitescu, Doneanu, et al., 1997 | 15. m/0.25 mm/0.25 μm, He; Program: 40C(5min) => 5C/min => 120C(10min) => 4C/min => 250C(4min) => 5C/min => 280C |
Capillary | DB-1 | 1059. | Gaspar, Palma, et al., 1997 | 30. m/0.25 mm/0.25 μm, He; Program: 45C => 3C/min => 175C => 15C/min => 280C |
Capillary | OV-101 | 1068. | Morales and Duque, 1987 | He; Column length: 25. m; Column diameter: 0.31 mm; Program: not specified |

Normal alkane RI, polar column, temperature ramp

Column type | Active phase | I | Reference | Comment |
---|---|---|---|---|
Capillary | HP-Innowax | 1475. | Wannes, Mhamdi, et al., 2009 | 30. m/0.25 mm/0.52 μm, Nitrogen, 35. C @ 10. min, 3. K/min, 205. C @ 10. min |
Capillary | DB-Wax | 1472. | Zhao, Xu, et al., 2009 | 30. m/0.25 mm/0.25 μm, Helium, 40. C @ 2. min, 3. K/min, 230. C @ 5. min |
Capillary | HP-Innowax | 1477. | Soria, Sanz, et al., 2008 | 50. m/0.20 mm/0.20 μm, Helium, 45. C @ 2. min, 4. K/min, 190. C @ 50. min |
Capillary | Carbowax | 1450. | Ferhat, Tigrine-Kordjani, et al., 2007 | 60. m/0.2 mm/0.25 μm, He, 60. C @ 8. min, 2. K/min, 250. C @ 15. min |
Capillary | TC-FFAP | 1453. | Kurose, Okamura, et al., 2007 | He, 3. K/min, 220. C @ 30. min; Column diameter: 0.25 mm; Phase thickness: 0.25 μm; Tstart: 60. C |
Capillary | Supelcowax-10 | 1475. | Vichi, Riu-Aumatell, et al., 2007 | 30. m/0.25 mm/0.25 μm, He, 40. C @ 5. min, 3. K/min, 250. C @ 10. min |
Capillary | DB-Wax | 1466. | Cai, Lin, et al., 2006 | 60. m/0.25 mm/0.5 μm, He, 50. C @ 2. min, 3. K/min, 230. C @ 20. min |
Capillary | DB-Wax Etr | 1476. | Ibarz, Ferreira, et al., 2006 | 60. m/0.25 mm/0.25 μm, He, 40. C @ 5. min, 2. K/min, 230. C @ 100. min |
Capillary | DB-Wax | 1473. | Lan Phi N.T., Nishiyama C., et al., 2006 | 60. m/0.25 mm/0.25 μm, 70. C @ 2. min, 2. K/min, 230. C @ 20. min |
Capillary | Supelcowax | 1438. | Martin, Joseph, et al., 2006 | 30. m/0.32 mm/0.25 μm, N2, 5. K/min; Tstart: 50. C; Tend: 200. C |
Capillary | HP-Wax | 1469. | Marzouk, Mansour, et al., 2006 | 30. m/0.25 mm/0.25 μm, Nitrogen, 5. K/min, 280. C @ 5. min; Tstart: 50. C |
Capillary | HP-20M | 1469. | Marzouk, Neffati, et al., 2006 | 30. m/0.25 mm/0.25 μm, N2, 5. K/min, 250. C @ 10. min; Tstart: 50. C |
Capillary | HP-20M | 1434. | Mastelic, Jerkovic, et al., 2006 | 50. m/0.2 mm/0.2 μm, He, 70. C @ 4. min, 4. K/min, 180. C @ 15. min |
Capillary | NB-20M | 1453. | Orav, Raal, et al., 2006 | 30. m/0.2 mm/0.25 μm, He, 2. K/min; Tstart: 50. C; Tend: 250. C |
Capillary | DB-Wax | 1477. | Sawamura, Onishi, et al., 2006 | 60. m/0.25 mm/0.25 μm, 70. C @ 2. min, 2. K/min, 230. C @ 20. min |
Capillary | Carbowax-PEG | 1450. | Tigrine-Kordiani, Meklati, et al., 2006 | 60. m/0.20 mm/0.25 μm, Helium, 60. C @ 8. min, 2. K/min, 250. C @ 15. min |
Capillary | Supelcowax-10 | 1438. | Wong, Lim, et al., 2006 | 30. m/0.25 mm/0.25 μm, He, 50. C @ 1. min, 4. K/min, 220. C @ 10. min |
Capillary | Supelcowax-10 | 1480. | Wong, Sivasothy, et al., 2006 | 30. m/0.25 mm/0.25 μm, He, 50. C @ 1. min, 4. K/min, 250. C @ 10. min |
Capillary | Carbowax 20M | 1451. | Babu and Kaul, 2005 | 60. m/0.25 mm/0.25 μm, N2, 40. C @ 2. min, 10. K/min, 190. C @ 15. min |
Capillary | Carbowax 20M | 1461. | de la Fuente, Martinez-Castro, et al., 2005 | 50. m/0.25 mm/0.25 μm, Helium, 40. C @ 2. min, 4. K/min, 190. C @ 30. min |
Capillary | Supelcowax | 1438. | Gauvin and Smadja, 2005 | 60. m/0.2 mm/0.2 μm, He, 60. C @ 30. min, 4. K/min; Tend: 230. C |
Capillary | Stabilwax | 1436. | Jirovetz, Buchbauer, et al., 2005 | 30. m/0.32 mm/0.5 μm, 40. C @ 5. min, 6. K/min, 280. C @ 5. min |
Capillary | DB-Wax | 1468. | Lee, Umano, et al., 2005 | 30. m/0.25 mm/0.25 μm, He, 3. K/min, 180. C @ 40. min; Tstart: 50. C |
Capillary | DB-Wax | 1481. | Njoroge, Koaze, et al., 2005 | 60. m/0.25 mm/0.25 μm, N2, 70. C @ 2. min, 2. K/min, 230. C @ 20. min |
Capillary | Supelcowax-10 | 1435. | Wong and Tan, 2005 | 30. m/0.25 mm/0.25 μm, He, 50. C @ 3. min, 4. K/min, 220. C @ 30. min |
Capillary | DB-Wax | 1480. | Choi, 2004 | 60. m/0.25 mm/0.25 μm, N2, 70. C @ 2. min, 2. K/min, 230. C @ 20. min |
Capillary | DB-Wax | 1459. | Choi, 2004, 2 | 60. m/0.25 mm/0.25 μm, N2, 70. C @ 2. min, 2. K/min, 230. C @ 20. min |
Capillary | NB-20M | 1455. | Raal, Arak, et al., 2004 | 50. m/0.2 mm/0.25 μm, He, 2. K/min; Tstart: 50. C; Tend: 250. C |
Capillary | HP-Innowax | 1483. | Soria, Gonzalez, et al., 2004 | 50. m/0.2 mm/0.2 μm, He, 45. C @ 2. min, 4. K/min, 190. C @ 50. min |
Capillary | Carbowax 20M | 1463. | Agnaniet, Mounzeo, et al., 2003 | 25. m/0.22 mm/0.25 μm, N2, 5. K/min; Tstart: 50. C; Tend: 200. C |
Capillary | DB-Wax | 1475. | Mookdasanit, Tamura, et al., 2003 | Helium, 2. K/min, 210. C @ 60. min; Column length: 60. m; Column diameter: 0.25 mm; Tstart: 70. C |
Capillary | HP-Innowax | 1478. | Soria, Martinez-Castro, et al., 2003 | 50. m/0.2 mm/0.2 μm, He, 45. C @ 2. min, 4. K/min, 190. C @ 50. min |
Capillary | Carbowax 20M | 1478. | Soria, Martinez-Castro, et al., 2003 | 50. m/0.25 mm/0.25 μm, He, 45. C @ 2. min, 4. K/min, 190. C @ 50. min |
Capillary | DB-Wax | 1441. | Tu, Onishi, et al., 2003 | 60. m/0.25 mm/0.25 μm, N2, 70. C @ 2. min, 2. K/min, 230. C @ 20. min |
Capillary | DB-Wax | 1454. | Ito, Sugimoto, et al., 2002 | 60. C @ 4. min, 3. K/min; Column length: 60. m; Column diameter: 0.25 mm; Tend: 180. C |
Capillary | Supelcowax-10 | 1451. | Orav, Kailas, et al., 2002 | 60. m/0.2 mm/0.5 μm, He, 2. K/min; Tstart: 70. C; Tend: 220. C |
Capillary | DB-Wax | 1464. | Tu, Onishi, et al., 2002 | 60. m/0.25 mm/0.25 μm, N2, 70. C @ 2. min, 2. K/min, 230. C @ 20. min |
Capillary | DB-Wax | 1480. | Tu, Thanh, et al., 2002 | 60. m/0.25 mm/0.25 μm, N2, 2. K/min; Tstart: 70. C; Tend: 230. C |
Capillary | DB-Wax | 1439. | Kato and Shibamoto, 2001 | 30. m/0.25 mm/0.1 μm, He, 40. C @ 5. min, 2. K/min, 180. C @ 20. min |
Capillary | CP-Wax 52CB | 1450. | Chagonda, Makanda, et al., 2000 | 50. m/0.30 mm/0.25 μm, He, 40. C @ 5. min, 3. K/min; Tend: 220. C |
Capillary | DB-Wax | 1461. | Morales, Duque, et al., 2000 | 25. m/0.25 mm/0.25 μm, He, 50. C @ 4. min, 4. K/min, 200. C @ 10. min |
Capillary | DB-Wax | 1461. | Morales, Duque, et al., 2000 | 25. m/0.25 mm/0.25 μm, He, 50. C @ 4. min, 4. K/min, 200. C @ 10. min |
Capillary | DB-Wax | 1440. | Parada, Duque, et al., 2000 | 30. m/0.25 mm/0.25 μm, He, 50. C @ 3. min, 4. K/min, 240. C @ 10. min |
Capillary | DB-Wax | 1455. | Parada, Duque, et al., 2000 | 30. m/0.25 mm/0.25 μm, He, 50. C @ 3. min, 4. K/min, 240. C @ 10. min |
Capillary | Carbowax | 1451. | Menon, Chacko, et al., 1999 | N2, 1. K/min, 200. C @ 20. min; Column length: 50. m; Column diameter: 0.2 mm; Tstart: 80. C |
Capillary | HP-Innowax | 1453. | Ong and Acree, 1999 | 4. K/min; Column length: 25. m; Column diameter: 0.25 mm; Tstart: 35. C; Tend: 250. C |
Capillary | DB-Wax | 1471. | Umano, Nakahara, et al., 1999 | 60. m/0.25 mm/0.25 μm, He, 40. C @ 2. min, 2. K/min; Tend: 200. C |
Capillary | Supelcowax-10 | 1449. | Lamarque, Maestri, et al., 1998 | He, 4. K/min; Column length: 30. m; Column diameter: 0.25 mm; Tstart: 60. C; Tend: 240. C |
Capillary | HP-Innowax | 1453. | Ong and Acree, 1998 | 4. K/min; Column length: 25. m; Column diameter: 0.32 mm; Tstart: 35. C; Tend: 250. C |
Capillary | HP-Innowax | 1453. | Ong, Acree, et al., 1998 | 4. K/min; Column length: 25. m; Column diameter: 0.32 mm; Tstart: 35. C; Tend: 250. C |
Capillary | TC-Wax | 1475. | Shuichi, Masazumi, et al., 1996 | 80. C @ 5. min, 3. K/min; Column length: 60. m; Column diameter: 0.25 mm; Tend: 240. C |
Capillary | Supelcowax-10 | 1468. | Wong and Lai, 1996 | 60. m/0.25 mm/0.25 μm, He, 40. C @ 3. min, 3. K/min, 200. C @ 30. min |
Capillary | Carbowax 20M | 1440. | Kawakami, Kobayashi, et al., 1993 | He, 60. C @ 4. min, 2. K/min; Column length: 50. m; Column diameter: 0.25 mm; Tend: 180. C |
Capillary | Carbowax 20M | 1440. | Kawakami and Kobayashi, 1991 | He, 60. C @ 4. min, 2. K/min; Column length: 50. m; Column diameter: 0.25 mm; Tend: 180. C |
Capillary | DB-Wax | 1425. | Takeoka, Buttery, et al., 1991 | 60. m/0.32 mm/0.25 μm, He, 30. C @ 4. min, 2. K/min, 180. C @ 25. min |
Capillary | Carbowax 20M | 1464. | Mihara, Tateba, et al., 1988 | N2, 3. K/min; Column length: 50. m; Column diameter: 0.22 mm; Tstart: 80. C; Tend: 200. C |
Capillary | Carbowax 20M | 1465. | Mihara, Tateba, et al., 1988 | N2, 3. K/min; Column length: 50. m; Column diameter: 0.22 mm; Tstart: 80. C; Tend: 200. C |
Capillary | DB-Wax | 1438. | Takeoka, Flath, et al., 1988 | 60. m/0.25 mm/0.25 μm, H2, 30. C @ 2. min, 2. K/min; Tend: 180. C |
Capillary | DB-Wax | 1439. | Takeoka, Flath, et al., 1988 | 60. m/0.25 mm/0.25 μm, H2, 30. C @ 2. min, 2. K/min; Tend: 180. C |
Capillary | Carbowax 20M | 1464. | Mihara, Tateba, et al., 1987 | N2, 3. K/min; Column length: 50. m; Column diameter: 0.22 mm; Tstart: 80. C; Tend: 200. C |
Capillary | Carbowax 20M | 1465. | Mihara, Tateba, et al., 1987 | N2, 3. K/min; Column length: 50. m; Column diameter: 0.22 mm; Tstart: 80. C; Tend: 200. C |
Capillary | Carbowax 20M | 1440. | Buttery, Xu, et al., 1985 | 60. C @ 40. min, 1. K/min; Column length: 150. m; Column diameter: 0.66 mm; Tend: 170. C |
Capillary | Carbowax 20M | 1424. | Engel and Tressl, 1983 | 2. K/min; Column length: 50. m; Column diameter: 0.32 mm; Tstart: 70. C; Tend: 180. C |
Capillary | Carbowax 20M | 1440. | Buttery, Parker, et al., 1981 | 50. C @ 30. min, 1. K/min; Column length: 150. m; Column diameter: 0.64 mm; Tend: 170. C |

Normal alkane RI, polar column, custom temperature program

Column type | Active phase | I | Reference | Comment |
---|---|---|---|---|
Capillary | DB-Wax | 1463. | Zhao, Xu, et al., 2009 | 30. m/0.25 mm/0.25 μm, Helium; Program: not specified |
Capillary | Supelcowax 10 | 1477. | Soria, Martinez-Castro, et al., 2008 | 50. m/0.25 mm/0.25 μm, Helium; Program: 45 0C (15 min) 3 0C/min -> 75 0C 5 0C/min -> 180 0C (10 min) |
Capillary | DB-Wax Etr | 1476. | Loskos, Hernandez-Orte, et al., 2007 | 60. m/0.25 mm/0.5 μm, He; Program: 40C(3min) => 10C/min => 90C => 2C/min => 230C (37min) |
Capillary | HP-Innowax | 1424. | Narain, Galvao, et al., 2007 | 30. m/0.25 mm/0.25 μm, Helium; Program: 30 0C (5 min) 5 0C/min -> 100 0C (5 min) 1 0C/min -> 130 0C 10 0C/min -> 195 0C (45 min) |
Capillary | BP-20 | 1439. | Pontes, Marques, et al., 2007 | 30. m/0.25 mm/0.25 μm, He; Program: 50C(1min) => 2.5C/min => 100C => 2C/min => 180C => 15C/min => 220C |
Capillary | BP-20 | 1439. | Pontes, Marques, et al., 2007 | 30. m/0.25 mm/0.25 μm, He; Program: 50C(1min) => 2.5C/min => 100C => 2C/min => 180C => 15C/min => 220C |
Capillary | DB-Wax | 1474. | Selli, 2007 | 30. m/0.32 mm/0.50 μm, Hydrogen; Program: 60 0C (3 min) 2 0C/min -> 220 0C 3 0C/min -> 245 0C (20 min) |
Capillary | Innowax FSC | 1450. | Iscan, Kirimer, et al., 2006 | 60. m/0.25 mm/0.25 μm, N2; Program: 60C(10min) => 4C/min => 220C(10min) => 1C/min => 240C |
Capillary | HP-Innowax FSC | 1450. | Tabanca, Demirci, et al., 2006 | 60. m/0.25 mm/0.25 μm, N2; Program: 60C(10min) => 4C/min => 220C => (10min) => 1C/min => 240C |
Capillary | Carbowax 20M | 1450. | Editorial paper, 2005 | Program: not specified |
Capillary | Carbowax 20M | 1451. | Editorial paper, 2005 | Program: not specified |
Capillary | Innowax FSC | 1450. | Kosar, Özek, et al., 2005 | 60. m/0.25 mm/0.25 μm, He; Program: 60C(10min) => 4C/min => 220C(10min) => 1C/min => 240C |
Capillary | HP-Innowax FSC | 1450. | Viljoen, Subramoney, et al., 2005 | 60. m/0.25 mm/0.25 μm, He; Program: 60C(10min) => 4C/min => 220C(10min) => 1C/min => 240C |
Capillary | HP-Innowax FSC | 1450. | Demirci, Paper, et al., 2004 | 60. m/0.25 mm/0.25 μm, N2; Program: 60C(10min) => 4C/min => 220C(10min) => 1C/min => 240C |
Capillary | HP-Innowax FSC | 1450. | Kivcak, Akay, et al., 2004 | 60. m/0.25 mm/0.25 μm, He; Program: 60C(10min) => 4C/min => 220C(10min) => 1C/min => 240C |
Capillary | Carbowax 20M | 1455. | Vinogradov, 2004 | Program: not specified |
Capillary | Innowax FSC | 1450. | Baser, Demirci, et al., 2003 | 60. m/0.25 mm/0.25 μm, He; Program: 60C(10min) => 4C/min => 220C (10min) => 1C/min => 240C |
Capillary | HP-Innowax FSC | 1450. | Demirci, Baser, et al., 2003 | 60. m/0.25 mm/0.25 μm, He; Program: 60C (10min) => 4C/min => 220C (10min) => 1C/min => 240C |
Capillary | HP-Innowax | 1478. | Piasenzotto, Gracco, et al., 2003 | 30. m/0.32 mm/0.5 μm, He; Program: 50C(4min) => 10C/min => 230C(10min) => 10C/min => 250C |
Capillary | HP Innowax FSP | 1450. | Tasdemir, Demirci, et al., 2003 | 60. m/0.25 mm/0.25 μm, He; Program: 60C(10min) => 4C/min => 220C (10min) => 1C/min => 240C |
Capillary | HP Innowax FSP | 1450. | Tasdemir, Demirci, et al., 2003 | 60. m/0.25 mm/0.25 μm, He; Program: 60C(10min) => 4C/min => 220C (10min) => 1C/min => 240C |
Capillary | HP-Innowax | 1450. | Viljoen, van Vuuren, et al., 2003 | 60. m/0.25 mm/0.25 μm; Program: 60C(10min) => 4C/min => 220C(10min) => 1C/min => 240C |
Capillary | HP-Innowax | 1450. | Baser, Demirci, et al., 2002 | 60. m/0.25 mm/0.25 μm, He; Program: 60 0C (10 min) 4 K/min -> 220 0C (10 min) 1 K/min -> 240 0C |
Capillary | HP-Innowax | 1450. | Baser, Demirci, et al., 2001 | 60. m/0.25 mm/0.25 μm, He; Program: 60 0C (10 min) 10 K/min -> 220 0C (10 min) 1K/min -> 240 0C |
Capillary | HP-Innowax FSC | 1450. | Kaya, Demirci, et al., 2001 | 60. m/0.25 mm/0.25 μm; Program: 60C(10min) => 4C/min => 220C(10min) => 1C/min => 240C |
Capillary | Innowax FSC | 1450. | Saglam, Gozler, et al., 2001 | 60. m/0.25 mm/0.25 μm, He; Program: 60C(10min) => 4C/min => 220C(10min) => 1C/min => 240C |
Capillary | DB-Wax | 1445. | Schneider, Razungles, et al., 2001 | 30. m/0.25 mm/0.5 μm, He; Program: 30C => 70C/min => 60C (3min) => 3C/min => 245C (20min) |
Capillary | HP-Innowax | 1450. | Tabanca, Kirimer, et al., 2001 | 60. m/0.25 mm/0.25 μm, He; Program: 60C(10min) => 4C/min => 220C(10min) => 1C/min => 240C |
Capillary | HP-Innowax FSC | 1452. | Kamariah, Lim, et al., 1999 | 60. m/0.25 mm/0.25 μm, He; Program: 60C(10min) => 4C/min => 220C(10min) => 1C/min => 240C(20min) |
Capillary | Innowax | 1452. | Baser, Kürkcüoglu, et al., 1998 | 60. m/0.25 mm/0.25 μm; Program: 60C(10min) => 4C/min => 220C(10min) => 1C/min => 240C |
Capillary | Carbowax 20M | 1458. | Vernin, Lageot, et al., 1998 | Program: not specified |
Capillary | DB-Wax | 1447. | Weyerstahl, Marschall, et al., 1998 | N2; Column length: 60. m; Phase thickness: 0.25 μm; Program: not specified |
Capillary | DB-Wax | 1438. | Weyerstahl, Marschall, et al., 1998, 2 | N2; Column length: 60. m; Phase thickness: 0.25 μm; Program: not specified |
Capillary | CP-Wax 52CB | 1449. | López-Tamames, Carro-Mariño, et al., 1997 | 25. m/0.3 mm/1.2 μm, H2; Program: 60C(3min) => 2C/min => 220C => 3C/min => 245C |
Capillary | CP-Wax 52 CB | 1449. | Carro Marino, López Tamames, et al., 1995 | H2; Column length: 30. m; Column diameter: 0.32 mm; Program: 60 0C 2 0C/min -> 220 0C 3 0C/min -> 245 0C |
Capillary | Polyethylene Glycol | 1451. | MacLeod and Pieris, 1981 | Program: not specified |

References

Jalali-Heravi, Zekavat, et al., 2006
Jalali-Heravi, M.; Zekavat, B.; Sereshti, H.,
Characterization of essential oil components of Iranian geranium oil using gas chromatography-mass spectrometry combined with chemometric resolution techniques,
J. Chromatogr. A, 2006, 1114, 1, 154-163, https://doi.org/10.1016/j.chroma.2006.02.034
. [all data]
Mevy, Bessiere, et al., 2006
Mevy, J.-P.; Bessiere, J.-M.; Greff, S.; Zombre, G.; Viano, J.,
Composition of the volatile oil from the leaves of Ximenia americana L.,
Biochem. Syst. Ecol., 2006, 34, 7, 549-553, https://doi.org/10.1016/j.bse.2006.01.007
. [all data]
Mevy, Bessiere, et al., 2006, 2
Mevy, J.P.; Bessiere, J.M.; Rabier, J.; Dherbomez, M.; Ruzzier, M.; Millogo, J.; Viano, J.,
Composition and antimicrobial activities of the essential oil of Triumfetta rhomboidea Jacq.,
Flavour Fragr. J., 2006, 21, 1, 80-83, https://doi.org/10.1002/ffj.1511
. [all data]
Srivastava, Srivastava, et al., 2006
Srivastava, A.K.; Srivastava, S.K.; Syamsundar, K.V.,
Volatile composition of Curcuma angustifolia Roxb. rhizome from central and southern India,
Flavour Fragr. J., 2006, 21, 3, 423-426, https://doi.org/10.1002/ffj.1680
. [all data]
Tayoub, Schwob, et al., 2006
Tayoub, G.; Schwob, I.; Bessiere, J.-M.; Masotti, V.; Rabier, J.; Ruzzier, M.; Viano, J.,
Composition of volatile oils of Styrax (Styrax officinalis L.) leaves at different phenological stages,
Biochem. Syst. Ecol., 2006, 34, 9, 705-709, https://doi.org/10.1016/j.bse.2006.05.008
. [all data]
Tayoub, Schwob, et al., 2006, 2
Tayoub, G.; Schwob, I.; Bessière, J.-M.; Rabier, J.; Masotti, V.; J.; M.; Girard, G.; Viano, J.,
Essential oil composition of leaf, flower and stem of Styrax (Styrax officinalis L.) from south-eastern France,
Flavour Fragr. J., 2006, 21, 5, 809-812, https://doi.org/10.1002/ffj.1731
. [all data]
Walde, Jyothirmayi, et al., 2006
Walde, S.G.; Jyothirmayi, T.; Prabhakara Rao, P.G.; Srinivas, P.,
Flavour volatiles of flowers and stalks of Murraya koenigii L.,
Flavour Fragr. J., 2006, 21, 4, 581-584, https://doi.org/10.1002/ffj.1737
. [all data]
Adams and Nguyen, 2005
Adams, R.P.; Nguyen, S.,
Infra-specific variation in Juniperus deppeana and F. Sperryi in the Davis Mountains of Texas: variation in leaf essential oils and random amplified polymorphic DNAS (RAPDS),
Phytologia, 2005, 87, 2, 96-108. [all data]
Avato, Raffo, et al., 2004
Avato, P.; Raffo, F.; Aldouri, N.A.; Vartanian, S.T.,
Essential oils of varthemia iphionoides from Jordan,
Flavour Fragr. J., 2004, 19, 6, 559-561, https://doi.org/10.1002/ffj.1351
. [all data]
Gauvin, Lecomte, et al., 2004
Gauvin, A.; Lecomte, H.; Smadja, J.,
Comparative investigations of the essential oils of two scented geranium (Pelargonium spp.) cultivars grown on Reunion Island,
Flavour Fragr. J., 2004, 19, 5, 455-460, https://doi.org/10.1002/ffj.1354
. [all data]
Schwob, Bessiere, et al., 2004
Schwob, I.; Bessiere, J.-M.; Masotti, V.; Viano, J.,
Changes in essential oil composition in Saint John's wort (Hypericum perforatum L.) aerial parts during its phenological cycle,
Biochem. Syst. Ecol., 2004, 32, 8, 735-745, https://doi.org/10.1016/j.bse.2003.12.005
. [all data]
Amparo Blázquez, Pérez, et al., 2003
Amparo Blázquez, M.; Pérez, I.; Boira, H.,
Essential oil analysis of Teucrium libanitis and T. turredanum by GC and GC-MS,
Flavour Fragr. J., 2003, 18, 6, 497-501, https://doi.org/10.1002/ffj.1256
. [all data]
Baranauskiene, Venskutonis, et al., 2003
Baranauskiene, R.; Venskutonis, R.P.; Demyttenaere, J.C.R.,
Sensory and instrumental evaluation of catnip (Nepeta cataria L.) aroma,
J. Agric. Food Chem., 2003, 51, 13, 3840-3848, https://doi.org/10.1021/jf021187b
. [all data]
Nickavar, Salehi-Sormagi, et al., 2002
Nickavar, B.; Salehi-Sormagi, M.H.; Amin, Gh.; Daneshtalab, M.,
Steam volatiles of Vaccinium arctostaphylos,
Pharm. Biol., 2002, 40, 6, 448-449, https://doi.org/10.1076/phbi.40.6.448.8449
. [all data]
Raina, Srivastava, et al., 2002
Raina, V.K.; Srivastava, S.K.; Jain, N.; Ahmad, A.; Syamasundar, K.V.; Aggarwal, K.K.,
Essential oil composition of Curcuma longa L. cv. Roma from the plains of northern India,
Flavour Fragr. J., 2002, 17, 2, 99-102, https://doi.org/10.1002/ffj.1053
. [all data]
Rajeswara Rao, Kaul, et al., 2002
Rajeswara Rao, B.R.; Kaul, P.N.; Syamasundar, K.V.; Ramesh, S.,
Water soluble fractions of rose scented geranium (Pelargonium species) essential oil,
Bioresour. Technol., 2002, 84, 3, 243-246, https://doi.org/10.1016/S0960-8524(02)00057-3
. [all data]
Rajeswara Rao, 2002
Rajeswara Rao, B.R.,
Biomass yield, essential oil yield and essential oil composition of rose-scented geranium (Pelargonium species) as influenced by row spacings and intercropping with cornmint (Mentha arvensis L.f. piperascens Malinv. ex Holmes),
Ind. Crops Prod., 2002, 16, 2, 133-144, https://doi.org/10.1016/S0926-6690(02)00038-9
. [all data]
Rao B.R.R., 2002
Rao B.R.R.,
Biomass yield, essential oil yield and essential oil composition of rose-scented geranium (Pelargonium species) as influenced by row spacings and intercropping with cornmint (Mentha arvensis L.f. piperascens Malinv. ex Holmes),
Industrial Crops and Products, 2002, 16, 2, 133-144, https://doi.org/10.1016/S0926-6690(02)00038-9
. [all data]
Shawl, Srivastava, et al., 2002
Shawl, A.S.; Srivastava, S.K.; Syamasundar, K.V.; Tripathi, S.; Raina, V.K.,
Essential oil composition of Achillea millefolium L. growing wild in Kashmir, India,
Flavour Fragr. J., 2002, 17, 3, 165-168, https://doi.org/10.1002/ffj.1074
. [all data]
Jain, Aggarwal, et al., 2001
Jain, N.; Aggarwal, K.K.; Syamasundar, K.V.; Srivastava, S.K.; Kumar, S.,
Essential oil composition of geranium (Pelargonium sp.) from the plains of Northern India,
Flavour Fragr. J., 2001, 16, 1, 44-46, https://doi.org/10.1002/1099-1026(200101/02)16:1<44::AID-FFJ943>3.0.CO;2-X
. [all data]
Jain, Srivastava, et al., 2001
Jain, N.; Srivastava, S.K.; Aggarwal, K.K.; Ramesh, S.; Kumar, S.,
Essential oil composition of Zanthoxylum alatum seeds from northern India,
Flavour Fragr. J., 2001, 16, 6, 408-410, https://doi.org/10.1002/ffj.1024
. [all data]
Raina, Srivastava, et al., 2001
Raina, V.K.; Srivastava, S.K.; Aggarwal, K.K.; Ramesh, S.; Kumar, S.,
Essential oil composition of Cinnamomum zeylanicum Blume leaves from Little Andaman, India,
Flavour Fragr. J., 2001, 16, 5, 374-376, https://doi.org/10.1002/ffj.1016
. [all data]
Tzakou and Couladis, 2001
Tzakou, O.; Couladis, M.,
The essential oil of Micromeria graeca (L.) Bentham et Reichenb. growing in Greece,
Flavour Fragr. J., 2001, 16, 2, 107-109, https://doi.org/10.1002/ffj.955
. [all data]
Adams, 2000
Adams, R.P.,
Systematics of smooth leaf margin Juniperus of the western hemisphere based on leaf essential oils and RAPD DNA fingerprinting,
Biochem. Syst. Ecol., 2000, 28, 2, 149-162, https://doi.org/10.1016/S0305-1978(99)00047-2
. [all data]
Adams, 2000, 2
Adams, R.P.,
Systematics of the one seeded Juniperus of the eastern hemisphere based on leaf essential oils and random amplified polymorphic DNAs (RAPDs),
Biochem. Syst. Ecol., 2000, 28, 6, 529-543, https://doi.org/10.1016/S0305-1978(99)00096-4
. [all data]
Adams, 2000, 3
Adams, R.P.,
The serrate leaf margined Juniperus (Section Sabina) of the western hemisphere: systematics and evolution based on leaf essential oils and Random Amplified Polymorphic DNAs (RAPDs),
Biochem. Syst. Ecol., 2000, 28, 10, 975-989, https://doi.org/10.1016/S0305-1978(00)00022-3
. [all data]
Rao, Kaul, et al., 2000
Rao, B.R.R.; Kaul, P.N.; Mallavarapu, G.R.; Ramesh, S.,
First observation of little leaf disease and its impact on the yield and composition of the essential oil of rose-scented geranium (Pelargonium sp.),
Flavour Fragr. J., 2000, 15, 3, 137-140, https://doi.org/10.1002/1099-1026(200005/06)15:3<137::AID-FFJ880>3.0.CO;2-A
. [all data]
Rao, Sastry, et al., 2000
Rao, B.R.R.; Sastry, K.P.; Saleem, S.M.; Rao, E.V.S.P.; Syamasundar, K.V.; Ramesh, S.,
Volatile flower oils of three genotypes of rose-scented geranium (Pelargonium sp.),
Flavour Fragr. J., 2000, 15, 2, 105-107, https://doi.org/10.1002/(SICI)1099-1026(200003/04)15:2<105::AID-FFJ875>3.0.CO;2-G
. [all data]
Adams, 1999
Adams, R.P.,
Systematics of multi-seeded eastern hemisphere Juniperus based on leaf essential oils and RAPD DNA fingerprinting,
Biochem. Syst. Ecol., 1999, 27, 7, 709-725, https://doi.org/10.1016/S0305-1978(99)00016-2
. [all data]
Kaul, Gujral, et al., 1999
Kaul, V.K.; Gujral, R.K.; Singh, B.,
Volatile constituents of the essential oil of flowers of Rosa brunonii Lindl,
Flavour Fragr. J., 1999, 14, 1, 9-11, https://doi.org/10.1002/(SICI)1099-1026(199901/02)14:1<9::AID-FFJ761>3.0.CO;2-C
. [all data]
Kulkarni, Mallavarapu, et al., 1998
Kulkarni, R.N.; Mallavarapu, G.R.; Baskaran, K.; Ramesch, S.; Kumar, S.,
Composition of the essential oils of two isomenthone-rich variants of geranium (Pelargonium sp.),
Flavour Fragr. J., 1998, 13, 6, 389-392, https://doi.org/10.1002/(SICI)1099-1026(199811/12)13:6<389::AID-FFJ757>3.0.CO;2-2
. [all data]
Mallavarapu, Rao, et al., 1998
Mallavarapu, G.R.; Rao, B.R.R.; Kaul, P.N.; Ramesh, S.; Bhattacharya, A.K.,
Volatile constituents of the essential oils of the seeds and the herb of palmarosa (Cymbopogon martinii (Roxb.) Wats. var. motia Burk.),
Flavour Fragr. J., 1998, 13, 3, 167-169, https://doi.org/10.1002/(SICI)1099-1026(199805/06)13:3<167::AID-FFJ719>3.0.CO;2-B
. [all data]
Breheret, Talou, et al., 1997
Breheret, S.; Talou, T.; Rapior, S.; Bessiére, J.-M.,
Monoterpenes in the aroma of fresh wild mushrooms (Basidiomycetes),
J. Agric. Food Chem., 1997, 45, 3, 831-836, https://doi.org/10.1021/jf960417h
. [all data]
Jantan, Ahmad, et al., 1996
Jantan, I.; Ahmad, A.S.; Ahmad, A.R.; Ali, N.A.M.; Ayop, N.,
Chemical composition of some citrus oils from Malaysia,
J. Essent. Oil Res., 1996, 8, 6, 627-632, https://doi.org/10.1080/10412905.1996.9701030
. [all data]
von Poser, Menut, et al., 1996
von Poser, G.L.; Menut, C.; Toffoli, M.E.; Vérin, P.; Sobral, M.; Bessière, J.-M.; Lamaty, G.; Henriques, A.T.,
Essential oil composition and allelopathic effect of the Brazilian Lamiaceae Hesperozygis ringens (Benth.) Epling and Hesperozygis rhododon Epling,
J. Agric. Food Chem., 1996, 44, 7, 1829-1832, https://doi.org/10.1021/jf950653c
. [all data]
Menut, Molangui, et al., 1995
Menut, C.; Molangui, T.; Lamaty, G.E.; Bessière, J.-M.; Habimana, J.-B. Menut.; Molangui, T.; Lamaty, G.E.; Bessière, J.-M.; Habimana, J.-B.,
Aromatic plants of tropical Central Africa. 23. Chemical composition of leaf essential oils of Eucalyptus goniocalyx F. Muell. and Eucalyptus patens Benth. grown in Rwanda,
J. Agric. Food Chem., 1995, 43, 5, 1267-1271, https://doi.org/10.1021/jf00053a026
. [all data]
Morales and Duque, 1987
Morales, A.L.; Duque, C.,
Aroma constituents of the fruit of the moutain papaya (Carica pubescens) from Colombia,
J. Agric. Food Chem., 1987, 35, 4, 538-540, https://doi.org/10.1021/jf00076a024
. [all data]
Yamaguchi and Shibamoto, 1981
Yamaguchi, K.; Shibamoto, T.,
Volatile constituents of green tea, Gyokuro (Camellia sinensis L. var Yabukita),
J. Agric. Food Chem., 1981, 29, 2, 366-370, https://doi.org/10.1021/jf00104a035
. [all data]
Yamaguchi and Shibamoto, 1979
Yamaguchi, K.; Shibamoto, T.,
Volatile constituents of Castanopsis flower,
J. Agric. Food Chem., 1979, 27, 4, 847-850, https://doi.org/10.1021/jf60224a025
. [all data]
Alissandrakis E., Tarantilis P.A., et al., 2007
Alissandrakis E.; Tarantilis P.A.; Harizanis P.C.; Polissiou M.,
Comparison of the volatile composition in thyme honeys from several origins in Greece,
J. Agric. Food Chem., 2007, 55, 20, 8152-8157, https://doi.org/10.1021/jf071442y
. [all data]
Daferera, Ziogas, et al., 2003
Daferera, D.J.; Ziogas, B.N.; Polissiou, M.G.,
The effectiveness of plant essential oils on the growth of Botrytis cinerea, Fusarium sp. and Clavibacter michiganensis subsp. michiganensis,
Crop Prot., 2003, 22, 1, 39-44, retrieved from http://www.elsevier.com/gej-ng/10/25/40/84/25/31/article.pdf, https://doi.org/10.1016/S0261-2194(02)00095-9
. [all data]
Rao, Kaul, et al., 2003
Rao, B.R.R.; Kaul, P.N.; Syamasundar, K.V.; Ramesh, S.,
Comparative composition of decanted and recovered essential oils of Eucalyptus citriodora Hook,
Flavour Fragr. J., 2003, 18, 2, 133-135, https://doi.org/10.1002/ffj.1157
. [all data]
Wongpornchai, Sriseadka, et al., 2003
Wongpornchai, S.; Sriseadka, T.; Choonvisase, S.,
Identification and quantitation of the rice aroma compound, 2-acetyl-1-pyrroline, in bread flowers (Vallaris glabra Ktze),
J. Agric. Food Chem., 2003, 51, 2, 457-462, https://doi.org/10.1021/jf025856x
. [all data]
Borse, Jagan Mohan Rao, et al., 2002
Borse, B.B.; Jagan Mohan Rao, L.; Nagalakshmi, S.; Krishnamurthy, N.,
Fingerprint of black teas from India: identification of the regio-specific characteristics,
Food Chem., 2002, 79, 4, 419-424, https://doi.org/10.1016/S0308-8146(02)00191-7
. [all data]
Tudor, Moldovan, et al., 1999
Tudor, E.; Moldovan, D.; Zârna, N.,
Temperature dependence of the retention index for perfumery compounds on two carbowax-20M glass capillary columns with different film thickness. 2,
Rev. Roum. Chim., 1999, 44, 7, 665-675. [all data]
Chandravadana, Vekateshwarlu, et al., 2005
Chandravadana, M.V.; Vekateshwarlu, G.; Bujji Babu, C.S.; Roy, T.K.; Shivashankara, K.S.; Pandey, M.; Tewari, R.P.; Selvaraj, Y.,
Volatile flavour components of dry milky mushrooms (Calocybe indica),
Flavour Fragr. J., 2005, 20, 6, 715-717, https://doi.org/10.1002/ffj.1653
. [all data]
Venkateshwarlu, Chandravadana, et al., 1999
Venkateshwarlu, G.; Chandravadana, M.V.; Tewari, R.P.,
Volatile flavour components of some edible mushrooms (Basidiomycetes),
Flavour Fragr. J., 1999, 14, 3, 191-194, https://doi.org/10.1002/(SICI)1099-1026(199905/06)14:3<191::AID-FFJ810>3.0.CO;2-7
. [all data]
Umano, Hagi, et al., 1994
Umano, K.; Hagi, Y.; Tamura, T.; Shoji, A.; Shibamoto, T.,
Identification of volatile compounds isolated from round kumquat (Fortunella japonica Swingle),
J. Agric. Food Chem., 1994, 42, 9, 1888-1890, https://doi.org/10.1021/jf00045a011
. [all data]
Wong and Tie, 1993
Wong, K.C.; Tie, D.Y.,
The Essential Oil of the Leaves of Murraya koenigii Spreng.,
J. Essent. Oil Res., 1993, 5, 4, 371-374, https://doi.org/10.1080/10412905.1993.9698245
. [all data]
Tatsuka, Suekane, et al., 1990
Tatsuka, K.; Suekane, S.; Sakai, Y.; Sumitani, H.,
Volatile constituents of kiwi fruit flowers: simultaneous distillation and extraction versus headspace sampling,
J. Agric. Food Chem., 1990, 38, 12, 2176-2180, https://doi.org/10.1021/jf00102a015
. [all data]
Nishimura, Yamaguchi, et al., 1989
Nishimura, O.; Yamaguchi, K.; Mihara, S.; Shibamoto, T.,
Volatile Constituents of Guava Fruits (Psidium guajava L.) and Canned Puree,
J. Agric. Food Chem., 1989, 37, 1, 139-142, https://doi.org/10.1021/jf00085a033
. [all data]
MacLeod and Pieris, 1983
MacLeod, A.J.; Pieris, N.M.,
Volatile components of papaya (Carica papaya L.) with particular reference to glucosinolate products,
J. Agric. Food Chem., 1983, 31, 5, 1005-1008, https://doi.org/10.1021/jf00119a021
. [all data]
Tressl, Friese, et al., 1978
Tressl, R.; Friese, L.; Fendesack, F.; Köppler, H.,
Gas chromatographic--mass spectrometric investigation of hop aroma constituents in beer,
J. Agric. Food Chem., 1978, 26, 6, 1422-1426, https://doi.org/10.1021/jf60220a037
. [all data]
Tressl, Friese, et al., 1978, 2
Tressl, R.; Friese, L.; Fendesack, F.; Köppler, H.,
Studies of the volatile composition of hops during storage,
J. Agric. Food Chem., 1978, 26, 6, 1426-1430, https://doi.org/10.1021/jf60220a036
. [all data]
Cho, Namgung, et al., 2008
Cho, I.H.; Namgung, H.-J.; Choi, H.-K.; Kim, Y.-S.,
Volatiles and key odorants in the pileus and stipe of pine-mushroom (Tricholoma matsutake Sing.),
Food Chem., 2008, 106, 1, 71-76, https://doi.org/10.1016/j.foodchem.2007.05.047
. [all data]
Quijano, Salamanca, et al., 2007
Quijano, C.E.; Salamanca, G.; Pino, J.A.,
Aroma volatile constituents of Colombian varieties of mango (Mangifera indica L.),
Flavour Fragr. J., 2007, 22, 5, 401-406, https://doi.org/10.1002/ffj.1812
. [all data]
Radulovic, Lazarevic, et al., 2007
Radulovic, N.; Lazarevic, J.; Ristic, N.; Palic, R.,
Chemotaxonomic significance of the volatiles in the genus Stachys (Lamiaceae): Essential oil composition of four Balkan Stachys species,
Biochem. Syst. Ecol., 2007, 35, 4, 196-208, https://doi.org/10.1016/j.bse.2006.10.010
. [all data]
Sabulal, Dan, et al., 2007
Sabulal, B.; Dan, M.; John, A.; Kurup, R.; Chandrika, S.P.; George, V.,
Phenylbutanoid-rich rhizome oil of Zingiber neesanum from Western Ghats, southern India,
Flavour Fragr. J., 2007, 22, 6, 521-524, https://doi.org/10.1002/ffj.1834
. [all data]
Telascrea, de Araujo, et al., 2007
Telascrea, M.; de Araujo, C.C.; Marques, M.O.M.; Facanali, R.; de Moraes, P.L.R.; Cavalheiro, A.J.,
Essential oil from leaves of Cryptocarya mandioccana Meisner (Lauraceae): Composition and intraspecific chemical variability,
Biochem. Syst. Ecol., 2007, 35, 4, 222-232, https://doi.org/10.1016/j.bse.2006.09.015
. [all data]
Andrianoelisoa H.S., Menut C., et al., 2006
Andrianoelisoa H.S.; Menut C.; de Chatelperron P.C.; Saracco J.; Ramanoelina P.; Danthu P.,
Intraspecific chemical variability and highlighting of chemotypes of leaf essential oils from Ravensara aromatica Sonnerat a tree endemic to Madagascar,
Flavour Fragr. J., 2006, 21, 5, 833-838, https://doi.org/10.1002/ffj.1735
. [all data]
Bastos, Ishimoto, et al., 2006
Bastos, D.H.M.; Ishimoto, E.; Marques, M.O.M.; Ferri, A.F.; Torres, E.A.F.S.,
Essential oil and antioxidant activity of green mate and mate tea (Ilex paraguariensis) infusions,
J. Food Comp. Anal., 2006, 19, 6-7, 538-543, https://doi.org/10.1016/j.jfca.2005.03.002
. [all data]
Blagojevic, Radulovic, et al., 2006
Blagojevic, P.; Radulovic, N.; Palic, R.; Stojanovic, G.,
Chemical composition of the essential oils of Serbian wild-growing Srtemisia absinthium and Artemisia vulgaris,
J. Agric. Food Chem., 2006, 54, 13, 4780-4789, https://doi.org/10.1021/jf060123o
. [all data]
Bousmaha, Boti, et al., 2006
Bousmaha, L.; Boti, J.B.; Bekkara, F.A.; Castola, V.; Casanova, J.,
Infraspecific chemical variability of the essential oil of Lavandula dentata L. from Algeria,
Flavour Fragr. J., 2006, 21, 2, 368-372, https://doi.org/10.1002/ffj.1659
. [all data]
Dob, Dahmane, et al., 2006
Dob, T.; Dahmane, D.; Chelghoum, C.,
Essential oil composition of Juniperus oxycedrus growing in Algeria,
Pharm. Biol., 2006, 44, 1, 1-6, https://doi.org/10.1080/13880200500530922
. [all data]
Kuiate, Bessière, et al., 2006
Kuiate, J.R.; Bessière, J.M.; Vilarem, G.; Amvam Zollo, P.H.,
Chemical composition and antidermatophytic properties of the essential oils from leaves, flowers and fruits of Cupressus lusitanica Mill. from Cameroon,
Flavour Fragr. J., 2006, 21, 4, 693-697, https://doi.org/10.1002/ffj.1686
. [all data]
Nath, Baruah, et al., 2006
Nath, S.C.; Baruah, A.; Kanjilal, P.B.,
Chemical composition of the leaf essential oil of Cinnamomum pauciflorum Nees,
Flavour Fragr. J., 2006, 21, 3, 531-533, https://doi.org/10.1002/ffj.1688
. [all data]
Osorio, Alarcon, et al., 2006
Osorio, C.; Alarcon, M.; Moreno, C.; Bonilla, A.; Barrios, J.; Garzon, C.; Duque, C.,
Characterization of Odor-Active Volatiles in Champa ( Campomanesia lineatifolia R. P.),
J. Agric. Food Chem., 2006, 54, 2, 509-516, https://doi.org/10.1021/jf052098c
. [all data]
Ramezani, Behravan, et al., 2006
Ramezani, M.; Behravan, J.; Yazdinezhad, A.,
Composition and antimicrobial activity of the volatile oil of Artemisia kopetdaghensis Krasch., M.Pop. Linecz ex Poljak from Iran,
Flavour Fragr. J., 2006, 21, 6, 869-871, https://doi.org/10.1002/ffj.1644
. [all data]
Salgueiro L.R., Pinto E., et al., 2006
Salgueiro L.R.; Pinto E.; Goncalves M.J.; Costa I.; Palmeira A.; Cavaleiro C.; Pina-Vaz C.; Rodrigues A.G.; Martinez-De-Oliveira J.,
Antifungal activity of the essential oil of Thymus capitellatus against Candida, Aspergillus and dermatophyte strains,
Flavour Fragr. J., 2006, 21, 5, 749-753, https://doi.org/10.1002/ffj.1610
. [all data]
Saroglou, Dorizas, et al., 2006
Saroglou, V.; Dorizas, N.; Kypriotakis, Z.; Skaltsa, H.D.,
Analysis of the essential oil composition of eight Anthemis species from Greece,
J. Chromatogr. A, 2006, 1104, 1-2, 313-322, https://doi.org/10.1016/j.chroma.2005.11.087
. [all data]
Su, Ho, et al., 2006
Su, Y.-C.; Ho, C.-L.; Wang, E.I.-C.; Chang, S.-T.,
Antifungal activities and chemical compositions of essential oils from leaves of four eucalypts,
Taiwan J. For. Sci., 2006, 21, 1, 49-61. [all data]
Agnaniet, Makani, et al., 2005
Agnaniet, H.; Makani, T.; Akagah, A.; Menut, C.; Bessière, J.M.,
Volatile constituents and antioxidant activity of essential oils from Lippia multiflora Mold. growing in Gabon,
Flavour Fragr. J., 2005, 20, 1, 34-38, https://doi.org/10.1002/ffj.1383
. [all data]
Brantner, Pfeifhofer, et al., 2005
Brantner, A.H.; Pfeifhofer, H.W.; Ercegovac, O.; Males, Z.; Plazibat, M.,
Essential oil composition and antioxidant activity of Thymus bracteosus Vis. ex Benth.,
Flavour Fragr. J., 2005, 20, 6, 596-600, https://doi.org/10.1002/ffj.1494
. [all data]
Dob, Berramdane, et al., 2005
Dob, T.; Berramdane, T.; Dahmane, D.; Chelghoum, C.,
Chemical composition of the needles oil of Pinus canariensis from Algeria,
Chem. Nat. Compd. (Engl. Transl.), 2005, 41, 2, 165-167, https://doi.org/10.1007/s10600-005-0103-1
. [all data]
bin Jantan, Yalvema, et al., 2005
bin Jantan, I.; Yalvema, M.F.; Ahmad, N.W.; Jamal, J.A.,
Insecticidal activities of the leaf oils of eight Cinnamomum species against Aedes aegypti and Aedes albopictus,
Pharm. Biol., 2005, 43, 6, 526-532, https://doi.org/10.1080/13880200500220771
. [all data]
bin Jantan, Yalvema, et al., 2005, 2
bin Jantan, I.; Yalvema, M.F.; Ayop, N.; Ahmad, A.S.,
Constituents of the essential oils of Cinnamomum sintoc Blume from a mountain forest of Peninsular Malaysia,
Flavour Fragr. J., 2005, 20, 6, 601-604, https://doi.org/10.1002/ffj.1495
. [all data]
Javidnia, Miri, et al., 2005
Javidnia, K.; Miri, R.; Kamalinejad, M.; Edraki, N.,
Chemical composition of Ferula persica Wild. essential oil from Iran,
Flavour Fragr. J., 2005, 20, 6, 605-606, https://doi.org/10.1002/ffj.1496
. [all data]
Aligiannis, Kalpoutzakis, et al., 2004
Aligiannis, N.; Kalpoutzakis, E.; Kyriakopoulou, I.; Mitaku, S.; Chinou, I.B.,
Essential oils of Phlomis species growing in Greece: chemical composition and antimicrobial activity,
Flavour Fragr. J., 2004, 19, 4, 320-324, https://doi.org/10.1002/ffj.1305
. [all data]
Antunes, Sevinate-Pinto, et al., 2004
Antunes, T.; Sevinate-Pinto, I.; Barroso, J.G.; Cavaleiro, C.; Salgueiro, L.R.,
Micromorphology of trichomes and composition of essential oil of Teucrium capitatum,
Flavour Fragr. J., 2004, 19, 4, 336-340, https://doi.org/10.1002/ffj.1310
. [all data]
Fernández-Ocaña, Gómez-Rodríguez, et al., 2004
Fernández-Ocaña, A.M.; Gómez-Rodríguez, M.V.; Velasco-Negueruela, A.; Camacho-Simarro, A.M.; Fernández-López, C.; Altarejos, J.,
In vivo antifungal activity of the essential oil of Bupleurum gibraltarium against plasmopara halstedii in sunflower,
J. Agric. Food Chem., 2004, 52, 21, 6414-6417, https://doi.org/10.1021/jf040219n
. [all data]
Flach A., Dondon R.C., et al., 2004
Flach A.; Dondon R.C.; Singer R.B.; Koehler S.; Amaral M.D.E.; Marsaioli A.J.,
The chemistry of pollination in selected Brazilian maxillariinae orchids: Floral rewards and fragrance,
J. Chem. Ecol., 2004, 30, 5, 1045-1056, https://doi.org/10.1023/B:JOEC.0000028466.50392.ed
. [all data]
Javidnia, Miri, et al., 2004
Javidnia, K.; Miri, R.; Jafari, A.; Rezai, H.,
Analysis of the volatile constituents of Nepeta macrosiphon Boiss. grown in Iran,
Flavour Fragr. J., 2004, 19, 2, 156-158, https://doi.org/10.1002/ffj.1287
. [all data]
Javidnia, Miri, et al., 2004, 2
Javidnia, K.; Miri, R.; Kamalinejad, M.; Sarkarzadeh, H.; Jamalian, A.,
Chemical composition of the essential oils of Anthemis altissima L. grown in Iran,
Flavour Fragr. J., 2004, 19, 3, 213-216, https://doi.org/10.1002/ffj.1277
. [all data]
Javidnia, Miri, et al., 2004, 3
Javidnia, K.; Miri, R.; Sadeghpour, H.,
Composition of the volatile oil of Achillea wilhelmsii C. Koch from Iran,
DARU, 2004, 12, 2, 63-66, retrieved from http://www1.tums.ac.ir/daru/. [all data]
Moldão-Martins, Beirão-da-Costa, et al., 2004
Moldão-Martins, M.; Beirão-da-Costa, S.; Neves, C.; Cavaleiro, C.; Salgueiro, L.; Beirão-da-Costa, M.L.,
Olive oil flavoured by the essential oils of Mentha × piperita and Thymus mastichina L.,
Food Qual. Pref., 2004, 15, 5, 447-452, https://doi.org/10.1016/j.foodqual.2003.08.001
. [all data]
Ngassoum, Ousmaila, et al., 2004
Ngassoum, M.B.; Ousmaila, H.; Ngamo, L.T.; Maponmetsem, P.M.; Jirovetz, L.; Buchbauer, G.,
Aroma compounds of essential oils of two varieties of the spice plant Ocimum canum Sims from northern Cameroon,
J. Food Comp. Anal., 2004, 17, 2, 197-204, https://doi.org/10.1016/j.jfca.2003.08.002
. [all data]
Pino, Marbot, et al., 2004
Pino, J.A.; Marbot, R.; Vazquez, C.,
Volatile components of tamarind (Tamarindus indica L.) grown in Cuba,
J. Essent. Oil Res., 2004, 16, 4, 318-320, https://doi.org/10.1080/10412905.2004.9698731
. [all data]
Raina, Kumar, et al., 2004
Raina, V.K.; Kumar, A.; Srivastava, S.K.; Syamsundar, K.V.; Kahol, A.P.,
Essential oil composition of 'kewda' (Pandanus odoratissimus) from India,
Flavour Fragr. J., 2004, 19, 5, 434-436, https://doi.org/10.1002/ffj.1331
. [all data]
Reis, Pansarim, et al., 2004
Reis, M.G.; Pansarim, E.R.; da Silva, U.F.; Estanislau do Amaral, M.C.; Marsaioli, A.J.,
Pollinator attraction devices (floral fragrances) of some Brazilian orchids,
Arkivoc, 2004, 6, 89-97. [all data]
Salido, Valenzuela, et al., 2004
Salido, S.; Valenzuela, L.R.; Altarejos, J.; Nogueras, M.; Sánchez, A.; Cano, E.,
Composition and infraspecific variability of Artemisia herba-alba from southern Spain,
Biochem. Syst. Ecol., 2004, 32, 3, 265-277, https://doi.org/10.1016/j.bse.2003.09.002
. [all data]
Tam, Thuam, et al., 2004
Tam, N.T.; Thuam, D.T.; Bighelli, A.; Castola, V.; Muselli, A.; Richomme, P.; Casanova, J.,
Baeckea frutescens leaf oil from Vietnam: composition and chemical variability,
Flavour Fragr. J., 2004, 19, 3, 217-220, https://doi.org/10.1002/ffj.1281
. [all data]
bin Ahmad and bin Jantan, 2003
bin Ahmad, F.; bin Jantan, I.,
Chemical constituents of the essential oils of Goniothalamus uvariodes King,
Flavour Fragr. J., 2003, 18, 2, 128-130, https://doi.org/10.1002/ffj.1142
. [all data]
bin Jantan, Yassin, et al., 2003
bin Jantan, I.; Yassin, M.S.M.; Chin, C.B.; Chen, L.L.; Sim. N.L.,
Antifungal activity of the essential oils of nine Zingiberaceae species,
Pharm. Biol., 2003, 41, 5, 392-397, https://doi.org/10.1076/phbi.41.5.392.15941
. [all data]
Javidnia, Miri, et al., 2003
Javidnia, K.; Miri, R.; Azarpira, A.; Tabaei, S.M.H.,
Composition of the essential oil of Stachys setifera C.A. Mey ssp. iranica growing in Iran,
Flavour Fragr. J., 2003, 18, 4, 299-300, https://doi.org/10.1002/ffj.1165
. [all data]
Lalel, Singh, et al., 2003
Lalel, H.J.D.; Singh, Z.; Chye Tan, S.,
Glycosidically-bound aroma volatile compounds in the skin and pulp of 'Kensington Pride' mango fruit at different stages of maturity,
Postharvest Biol. Technol., 2003, 29, 2, 205-218, https://doi.org/10.1016/S0925-5214(02)00250-8
. [all data]
Pino, Almora, et al., 2003
Pino, J.; Almora, K.; Marbot, R.,
Volatile components of papaya (Carica papaya L., maradol variety) fruit,
Flavour Fragr. J., 2003, 18, 6, 492-496, https://doi.org/10.1002/ffj.1248
. [all data]
Pino, Marbot, et al., 2003
Pino, J.; Marbot, R.; Rosado, A.; Vázquez, C.,
Volatile constituents of fruits of Garcinia dulcis Kurz. from Cuba,
Flavour Fragr. J., 2003, 18, 4, 271-274, https://doi.org/10.1002/ffj.1187
. [all data]
Verzera, Trozzi, et al., 2003
Verzera, A.; Trozzi, A.; Gazea, F.; Cicciarelloi, G.; Cotroneo, A.,
Effects of rootstock on the composition of bergamot (Citrus bergamia Risso et Poiteau) essential oil,
J. Agric. Food Chem., 2003, 51, 1, 206-210, https://doi.org/10.1021/jf0206872
. [all data]
Javidnia, Miri, et al., 2002
Javidnia, K.; Miri, R.; Safavi, F.; Azarpira, A.; Shafiee, A.,
Composition of the essential oil of Nepeta persica Boiss from Iran,
Flavour Fragr. J., 2002, 17, 1, 20-22, https://doi.org/10.1002/ffj.1023
. [all data]
Javidnia, Miri, et al., 2002, 2
Javidnia, K.; Miri, R.; Kamalinejad, M.; Nasiri, A.,
Composition of the essential oil of Salvia mirzayanii Rech. f. Esfand from Iran,
Flavour Fragr. J., 2002, 17, 6, 465-467, https://doi.org/10.1002/ffj.1128
. [all data]
Mondello, Zappia, et al., 2002
Mondello, L.; Zappia, G.; Cotroneo, A.; Bonaccorsi, I.; Chowdhury, J.U.; Yusuf, M.; Dugo, G.,
Studies on the essential oil-bearing plants of Bangladesh. Part VIII. Composition of some Ocimum oils O. basilicum L. var. purpurascens; O. sanctum L. green; O. sanctum L. purple; O. americanum L., citral type; O. americanum L., camphor type,
Flavour Fragr. J., 2002, 17, 5, 335-340, https://doi.org/10.1002/ffj.1108
. [all data]
Pino, Marbot, et al., 2002
Pino, J.A.; Marbot, R.; Bello, A.,
Volatile compounds of Psidium salutare (H.B.K.) Berg. fruit,
J. Agric. Food Chem., 2002, 50, 18, 5146-5148, https://doi.org/10.1021/jf0116303
. [all data]
Pino, Marbot, et al., 2002, 2
Pino, J.A.; Marbot, R.; Vázquez, C.,
Characterization of volatile in Cosa Rican Guava [Psidium friedrichsthalianum (Berg) Niedenzu] fruit,
J. Agric. Food Chem., 2002, 50, 21, 6023-6026, https://doi.org/10.1021/jf011456i
. [all data]
Pintore, Usai, et al., 2002
Pintore, G.; Usai, M.; Bradesi, P.; Juliano, C.; Boatto, G.; Tomi, F.; Chessa, M.; Cerri, R.; Casanova, J.,
Chemical composition and antimicrobial activity of Rosmarinus officinalis L. oils from Sardinia and Corsica,
Flavour Fragr. J., 2002, 17, 1, 15-19, https://doi.org/10.1002/ffj.1022
. [all data]
Pitarokili, Couladis, et al., 2002
Pitarokili, D.; Couladis, M.; Petsikos-Panayotarou, N.; Tzakou, O.,
Composition and antifungal activity on soil-borne pathogens of the essential oil of Salvia sclarea from Greece,
J. Agric. Food Chem., 2002, 50, 23, 6688-6691, https://doi.org/10.1021/jf020422n
. [all data]
Shellie, Mondello, et al., 2002
Shellie, R.; Mondello, L.; Marriott, P.; Dugo, G.,
Characterisation of lavender essential oils by using gas chromatography-mass spectrometry with correlation of linear retention indices and comparison with comprehensive two-dimensional gas chromatography,
J. Chromatogr. A, 2002, 970, 1-2, 225-234, https://doi.org/10.1016/S0021-9673(02)00653-2
. [all data]
Lota, Serra, et al., 2001
Lota, M.-L.; Serra, D.R.; Jacquemond, C.; Tomi, F.; Casanova, J.,
Chemical variability of peel and leaf essential oils of sour orange,
Flavour Fragr. J., 2001, 16, 2, 89-96, https://doi.org/10.1002/1099-1026(200103/04)16:2<89::AID-FFJ950>3.0.CO;2-D
. [all data]
Salido, Altarejos, et al., 2001
Salido, S.; Altarejos, J.; Nogueras, M.; Sánchez, A.,
Chemical composition of the essential oil of Artemisia herba-alba Asso ssp. valentina (Lam.) Marcl.,
J. Essent. Oil Res., 2001, 13, 4, 221-224, https://doi.org/10.1080/10412905.2001.9699675
. [all data]
Alonzo, Bosco, et al., 2000
Alonzo, G.; Bosco, S.F.D.; Palazzolo, E.; Saiano, F.; Tusa, N.,
Citrus somatic hybrid leaf essential oil,
Flavour Fragr. J., 2000, 15, 4, 258-262, https://doi.org/10.1002/1099-1026(200007/08)15:4<258::AID-FFJ906>3.0.CO;2-F
. [all data]
Chen, Huang, et al., 1998
Chen, S.-H.; Huang, T.-C.; Ho, C.-T.; Tsai, P.-J.,
Extraction, analysis, and study on the volatiles in roselle tea,
J. Agric. Food Chem., 1998, 46, 3, 1101-1105, https://doi.org/10.1021/jf970720y
. [all data]
Tam, An, et al., 1998
Tam, N.T.; An, H.L.; Muselli, a.; Bighelli, A.; Casanova, J.,
Essential oil of an unidentified Illicium species from Ninh Binh Province, Vietnam,
Flavour Fragr. J., 1998, 13, 6, 393-396, https://doi.org/10.1002/(SICI)1099-1026(199811/12)13:6<393::AID-FFJ764>3.0.CO;2-R
. [all data]
Sakho, Chassagne, et al., 1997
Sakho, M.; Chassagne, D.; Crouzet, J.,
African mango glycosidically bound volatile compounds,
J. Agric. Food Chem., 1997, 45, 3, 883-888, https://doi.org/10.1021/jf960277b
. [all data]
Píry, Príbela, et al., 1995
Píry, J.; Príbela, A.; Durcanská, J.; Farkas, P.,
Fractionation of volatiles from blackcurrant (Ribes nigrum L.) by different extractive methods,
Food Chem., 1995, 54, 1, 73-77, https://doi.org/10.1016/0308-8146(95)92665-7
. [all data]
Combariza, Tirado, et al., 1994
Combariza, M.Y.; Tirado, C.B.; Stashenko, E.; Shibamoto, T.,
Limonene concentration in lemon (Citrus volkameriana) peel oil as a function of ripeness,
J. Hi. Res. Chromatogr., 1994, 17, 9, 643-646, https://doi.org/10.1002/jhrc.1240170905
. [all data]
Chung, Eiserich, et al., 1993
Chung, T.Y.; Eiserich, J.P.; Shibamoto, T.,
Volatile compounds isolated from edible Korean chamchwi (Aster scaber Thunb),
J. Agric. Food Chem., 1993, 41, 10, 1693-1697, https://doi.org/10.1021/jf00034a033
. [all data]
Yang, Sugisawa, et al., 1992
Yang, R.; Sugisawa, H.; Nakatani, H.; Tamura, H.; Takagi, N.,
Comparison of odor quality in peel oils of acid citrus,
Nippon Shokuhin Kogyo Gakkaishi, 1992, 39, 1, 16-24, https://doi.org/10.3136/nskkk1962.39.16
. [all data]
Sagrero-Nieves, de Pooter, et al., 1989
Sagrero-Nieves, L.; de Pooter, H.L.; Van Wassenhove, F.A.,
Major Volatile Constituents from the Fruit of Mammee Apple (Mammea americana L.),
J. Food Comp. Anal., 1989, 2, 4, 382-385, https://doi.org/10.1016/0889-1575(89)90010-0
. [all data]
Dharmawan, Kasapis, et al., 2007
Dharmawan, J.; Kasapis, S.; Curran, P.; Johnson, J.R.,
Characterization of volatile compounds in selected citrus fruits from Asia. Part I: freshly-squeezed juice,
Flavour Fragr. J., 2007, 22, 3, 228-232, https://doi.org/10.1002/ffj.1790
. [all data]
Pérez, Navarro, et al., 2007
Pérez, R.A.; Navarro, T.; de Lorenzo, C.,
HS-SPME analysis of the volatile compounds from spices as a source of flavour in 'Campo Real' table olive preparations,
Flavour Fragr. J., 2007, 22, 4, 265-273, https://doi.org/10.1002/ffj.1791
. [all data]
Cardeal, da Silva, et al., 2006
Cardeal, Z.L.; da Silva, M.D.R.G.; Marriott, P.J.,
Comprehensive two-dimensional gas chromatography/mass spectrometric analysis of pepper volatiles,
Rapid Commun. Mass Spectrom., 2006, 20, 19, 2823-2836, https://doi.org/10.1002/rcm.2665
. [all data]
Sampaio and Nogueira, 2006
Sampaio, T.S.; Nogueira, P.C.L.,
Volatile components of mangaba fruit (Hancornia speciosa Gomes) at three stages of maturity,
Food Chem., 2006, 95, 4, 606-610, https://doi.org/10.1016/j.foodchem.2005.01.038
. [all data]
Gopanraj, Dan, et al., 2005
Gopanraj; Dan, M.; Shiburaj, S.; Sethuraman, M.G.; George, V.,
Chemical composition and antibacterial activity of the rhizome oil of Hedychium larsenii,
Acta Pharm. Sin., 2005, 55, 315-320. [all data]
Sanz, Soria, et al., 2004
Sanz, J.; Soria, A.C.; García-Vallejo, M.C.,
Analysis of volatile components of Lavandula luisieri L. by direct thermal desorption-gas chromatography-mass spectrometry,
J. Chromatogr. A, 2004, 1024, 1-2, 139-146, https://doi.org/10.1016/j.chroma.2003.10.024
. [all data]
Boulanger and Crouzet, 2001
Boulanger, R.; Crouzet, J.,
Identification of the aroma components of acerola (Malphigia glabra L.): free and bound flavor compounds,
Food Chem., 2001, 74, 2, 209-216, https://doi.org/10.1016/S0308-8146(01)00128-5
. [all data]
Lorenzo, Dellacassa, et al., 2001
Lorenzo, D.; Dellacassa, E.; Bonaccorsi, I.; Mondello, L.,
Uruguayan essential oils. Composition of leaf oil of Myrcianthes cisplatensis (Camb.) Berg. ('Guayabo colorado') (Myrtaceae),
Flavour Fragr. J., 2001, 16, 2, 97-99, https://doi.org/10.1002/1099-1026(200103/04)16:2<97::AID-FFJ952>3.0.CO;2-C
. [all data]
Boulanger and Crouzet, 2000
Boulanger, R.; Crouzet, J.,
Free and bound flavour components of Amazonian fruits: 2. cupuacu volatile compounds,
Flavour Fragr. J., 2000, 15, 4, 251-257, https://doi.org/10.1002/1099-1026(200007/08)15:4<251::AID-FFJ905>3.0.CO;2-2
. [all data]
Boulanger and Crouzet, 2000, 2
Boulanger, R.; Crouzet, J.,
Free and bound flavour components of Amazonian fruits: 3-glycosidically bound components of cupuacu,
Food Chem., 2000, 70, 4, 463-470, https://doi.org/10.1016/S0308-8146(00)00112-6
. [all data]
Boulanger, Chassagne, et al., 1999
Boulanger, R.; Chassagne, D.; Crouzet, J.,
Free and bound flavour components of amazonian fruits. 1: Bacuri,
Flavour Fragr. J., 1999, 14, 5, 303-311, https://doi.org/10.1002/(SICI)1099-1026(199909/10)14:5<303::AID-FFJ834>3.0.CO;2-C
. [all data]
Mondello, Dugo, et al., 1995
Mondello, L.; Dugo, P.; Basile, A.; Dugo, G.,
Interactive use of linear retention indices, on polar and apolar columns, with a MS-library for reliable identification of complex mixtures,
J. Microcolumn Sep., 1995, 7, 6, 581-591, https://doi.org/10.1002/mcs.1220070605
. [all data]
Sing, Smadja, et al., 1992
Sing, A.S.C.; Smadja, J.; Brevard, H.; Maignial, L.; Chaintreau, A.; Marion, J.-P.,
Volatile constituents of faham (Jumellea fragrans (Thou.) Schltr.),
J. Agric. Food Chem., 1992, 40, 4, 642-646, https://doi.org/10.1021/jf00016a024
. [all data]
Cho, Choi, et al., 2006
Cho, I.H.; Choi, H.-K.; Kim, Y.-S.,
Difference in the volatile composition of pine-mushrooms (Tricholoma matsutake Sing.) according to their grades,
J. Agric. Food Chem., 2006, 54, 13, 4820-4825, https://doi.org/10.1021/jf0601416
. [all data]
Ugliano, Bartowsky, et al., 2006
Ugliano, M.; Bartowsky, E.J.; McCarthy, J.; Moio, L.; Henschke, P.A.,
Hydrolysis and Transformation of Grape Glycosidically Bound Volatile Compounds during Fermentation with Three Saccharomyces Yeast Strains,
J. Agric. Food Chem., 2006, 54, 17, 6322-6331, https://doi.org/10.1021/jf0607718
. [all data]
Bonvehí, 2005
Bonvehí, J.S.,
Investigation of aromatic compounds in roasted cocoa powder,
Eur. Food Res. Technol., 2005, 221, 1-2, 19-29, https://doi.org/10.1007/s00217-005-1147-y
. [all data]
Choi, 2005
Choi, H.-S.,
Characteristic odor components of kumquat (Fortunella japonica Swingle) peel oil,
J. Agric. Food Chem., 2005, 53, 5, 1642-1647, https://doi.org/10.1021/jf040324x
. [all data]
Verzera, Campisi, et al., 2005
Verzera, A.; Campisi, S.; Zappalá, M.,
SUPELCO. Using SPME-GC-MS to characterize volatile components of honey as indicators of botanical origin, 2005, retrieved from http://www.sigmaaldrich.com/Brands/SupelcoHome/TheReporter.html. [all data]
Ledauphin, Saint-Clair, et al., 2004
Ledauphin, J.; Saint-Clair, J.-F.; Lablanquie, O.; Guichard, H.; Founier, N.; Guichard, E.; Barillier, D.,
Identification of trace volatile compounds in freshly distilled calvados and cognac using preparative separations coupled with gas chromatography-mass spectrometry,
J. Agric. Food Chem., 2004, 52, 16, 5124-5134, https://doi.org/10.1021/jf040052y
. [all data]
Ménager, Jost, et al., 2004
Ménager, I.; Jost, M.; Aubert, C.,
Changes in physicochemical characteristics and volatile constituents of strawberry (Cv. Cigaline) during maturation,
J. Agric. Food Chem., 2004, 52, 5, 1248-1254, https://doi.org/10.1021/jf0350919
. [all data]
Aubert, Ambid, et al., 2003
Aubert, C.; Ambid, C.; Baumes, R.; Günata, Z.,
Investigation of bound aroma constituents of yellow-fleshed nectarines (Prunus persica L. Cv. Springbright). Changes in bound aroma profile during maturation,
J. Agric. Food Chem., 2003, 51, 21, 6280-6286, https://doi.org/10.1021/jf034613h
. [all data]
Choi, 2003
Choi, H.-S.,
Character impact odorants of Citrus Hallabong [(C. unshiu Marcov × C. sinensis Osbeck) × C. reticulata Blanco] cold-pressed peel oil,
J. Agric. Food Chem., 2003, 51, 9, 2687-2692, https://doi.org/10.1021/jf021069o
. [all data]
Moreira, Trugo, et al., 2002
Moreira, R.F.A.; Trugo, L.C.; Pietroluongo, M.; de Maria, C.A.B.,
Flavor composition of cashew (Anacardium occidentale) and marmeleiro (Croton species) honeys,
J. Agric. Food Chem., 2002, 50, 26, 7616-7621, https://doi.org/10.1021/jf020464b
. [all data]
Pet'ka, Mocák, et al., 2001
Pet'ka, J.; Mocák, J.; Farkas, P.; Balla, B.; Kovác, M.,
Classification of Slovak varietal white wines by volatile compounds,
J. Sci. Food Agric., 2001, 81, 15, 1533-1539, https://doi.org/10.1002/jsfa.979
. [all data]
Verzera, Campisi, et al., 2001
Verzera, A.; Campisi, S.; Zappalá, M.; Bonaccorsi, I.,
SPME-GC-MS analysis of honey volatile components for the characterization of different floral origin,
Am. Lab. Fairfield Conn., 2001, 33, 15, 18-21. [all data]
Wirth, Guo, et al., 2001
Wirth, J.; Guo, W.; Baumes, R.; Günata, Z.,
Volatile compounds released by enzymatic hydrolysis of glycoconjugates of leaves and grape berries from Vitis vinifera muscat of Alexandria and Shiraz cultivars,
J. Agric. Food Chem., 2001, 49, 6, 2917-2923, https://doi.org/10.1021/jf001398l
. [all data]
Bureau, Razungles, et al., 2000
Bureau, S.M.; Razungles, A.R.; Baumes, R.L.,
The aroma of Muscat of Frontignan grapes: effect of the light environment of vine or bunch on volatiles and glycoconjugates,
J. Sci. Food Agric., 2000, 80, 14, 2012-2020, https://doi.org/10.1002/1097-0010(200011)80:14<2012::AID-JSFA738>3.0.CO;2-X
. [all data]
Choi and Sawamura, 2000
Choi, H.-S.; Sawamura, M.,
Composition of the essential oil of Citrus tamurana Hort. ex Tanaka (Hyuganatsu),
J. Agric. Food Chem., 2000, 48, 10, 4868-4873, https://doi.org/10.1021/jf000651e
. [all data]
Shimoda, Wu, et al., 1996
Shimoda, M.; Wu, Y.; Osajima, Y.,
Aroma compounds from aqueous solution of Haze (Rhus succedanea) honey determined by adsorptive column chromatography,
J. Agric. Food Chem., 1996, 44, 12, 3913-3918, https://doi.org/10.1021/jf9601168
. [all data]
Shimoda, Shigematsu, et al., 1995
Shimoda, M.; Shigematsu, H.; Shiratsuchi, H.; Osajima, Y.,
Comparison of the odor concentrates by SDE and adsorptive column method from green tea infusion,
J. Agric. Food Chem., 1995, 43, 6, 1616-1620, https://doi.org/10.1021/jf00054a037
. [all data]
Umano, Hagi, et al., 1992
Umano, K.; Hagi, Y.; Nakahara, K.; Shoji, A.; Shibamoto, T.,
Volatile constituents of green and ripened pineapple (Aanas comosus [L.] Merr.),
J. Agric. Food Chem., 1992, 40, 4, 599-603, https://doi.org/10.1021/jf00016a014
. [all data]
Humpf and Schreier, 1991
Humpf, H.-U.; Schreier, P.,
Bound aroma compounds from the fruit and the leaves of blackberry (Rubus laciniata L.),
J. Agric. Food Chem., 1991, 39, 10, 1830-1832, https://doi.org/10.1021/jf00010a028
. [all data]
Krammer, Winterhalter, et al., 1991
Krammer, G.; Winterhalter, P.; Schwab, M.; Schreier, P.,
Glycosidically bound aroma compounds in the fruits of Prunus species: Apricot (P. armeniaca, L.) peach (P. persica, L.) yellow plum (P. domestica, L. ssp. Syriaca),
J. Agric. Food Chem., 1991, 39, 4, 778-781, https://doi.org/10.1021/jf00004a032
. [all data]
Suárez and Duque, 1991
Suárez, M.; Duque, C.,
Volatile constituents of lulo (Salanum vestissimum D.) fruit,
J. Agric. Food Chem., 1991, 39, 8, 1498-1500, https://doi.org/10.1021/jf00008a026
. [all data]
Fröhlich, Duque, et al., 1989
Fröhlich, O.; Duque, C.; Schreier, P.,
Volatile constituents of curuba (Passiflora mollissima) fruit,
J. Agric. Food Chem., 1989, 37, 2, 421-425, https://doi.org/10.1021/jf00086a033
. [all data]
Schwab, Mahr, et al., 1989
Schwab, W.; Mahr, C.; Schreier, P.,
Studies on the enzymic hydrolysis of bound aroma components from Carica papaya fruit,
J. Agric. Food Chem., 1989, 37, 4, 1009-1012, https://doi.org/10.1021/jf00088a042
. [all data]
Chen and Ho, 1988
Chen, C.-C.; Ho, C.-T.,
Gas chromatographic analysis of volatile components of ginger oil (Zingiber officinale Roscoe) extracted with liquid carbon dioxide,
J. Agric. Food Chem., 1988, 36, 2, 322-328, https://doi.org/10.1021/jf00080a020
. [all data]
Chen, Kuo, et al., 1986
Chen, C.-C.; Kuo, M.-C.; Liu, S.-E.; Wu, C.-M.,
Volatile components of salted and pickled prunes (Prunus mume Sieb. et Zucc.),
J. Agric. Food Chem., 1986, 34, 1, 140-144, https://doi.org/10.1021/jf00067a038
. [all data]
Selli, Canbas, et al., 2006
Selli, S.; Canbas, A.; Cabaroglu, T.; Erten, H.; Gunata, Z.,
Aroma components of cv. Muscat of Bornova wines and influence of skin contact treatment,
Food Chem., 2006, 94, 3, 319-326, https://doi.org/10.1016/j.foodchem.2004.11.019
. [all data]
Aubert, Baumann, et al., 2005
Aubert, C.; Baumann, S.; Arguel, H.,
Optimization of the Analysis of Flavor Volatile Compounds by Liquid-Liquid Microextraction (LLME). Application to the Aroma Analysis of Melons, Peaches, Grapes, Strawberries, and Tomatoes,
J. Agric. Food Chem., 2005, 53, 23, 8881-8895, https://doi.org/10.1021/jf0510541
. [all data]
Boido, Lloret, et al., 2003
Boido, E.; Lloret, A.; Medina, K.; Fariña, L.; Carrau, f.; Versini, G.; Dellacassa, E.,
Aroma composition of Vitis vinifera Cv. Tannat: the typical red wine from Uruguay,
J. Agric. Food Chem., 2003, 51, 18, 5408-5413, https://doi.org/10.1021/jf030087i
. [all data]
Cantergiani, Brevard, et al., 2001
Cantergiani, E.; Brevard, H.; Krebs, Y.; Feria-Morales, A.; Amadò, R.; Yeretzian, C.,
Characterisation of the aroma of green Mexican coffee and identification of mouldy/earthy defect,
Eur. Food Res. Technol., 2001, 212, 6, 648-657, https://doi.org/10.1007/s002170100305
. [all data]
Pripdeevech and Saansoomchai, 2013
Pripdeevech, P.; Saansoomchai, J.,
Antibacterial activity and chemical composition of essential oil and various extracts of Fagraea fragrans Roxb. flowers,
Chiang Mai J. Sci., 2013, 40, 2, 214-223. [all data]
Radulovic, Dordevic, et al., 2010
Radulovic, N.S.; Dordevic, N.D.; Palic, R.M.,
Volatiles of Pleurospermum austriacum (L.) Hoffm. (Apiaceae),
J. Serbian Chem. Soc., 2010, 75, 12, 1-11, https://doi.org/10.2298/JSC100323127R
. [all data]
Takeoka, Hobbs, et al., 2010
Takeoka, G.R.; Hobbs, C.; Byeoung-Soo, P.,
Volatile constituents of the aerial parts of Salvia apiana Jepson,
J. Essential Oil. Res., 2010, 22, 3, 241-244, https://doi.org/10.1080/10412905.2010.9700314
. [all data]
Porto, Decorti, et al., 2009
Porto, C.Da.; Decorti, D.; Kikic, I.,
Flavour compounds of Lavandula angustifolia L. to use in food manufacturing: comparison of three different extraction methods,
Food Chem., 2009, 112, 4, 1072-1078, https://doi.org/10.1016/j.foodchem.2008.07.015
. [all data]
Wannes, Mhamdi, et al., 2009
Wannes, W.A.; Mhamdi, B.; Marzouk, B.,
GC comparative analysis of least essential oils from two Myrtle varieties at different phenological stages,
Chromatographia, 2009, 69, 1/2, 145-150, https://doi.org/10.1365/s10337-008-0818-9
. [all data]
Bastos, Ishimoto, et al., 2008
Bastos, D.H.M.; Ishimoto, E.Y.; Marques, O.M.; Ferri, A.F.; Torres, E.A.F.S.,
Essential Oil and Antioxidant Activity of Green Mate and Mate Tea (Ilex paraguariensis) Infusions, 2008, retrieved from http://www.aseanfood.info/Articles/11016488.pdf. [all data]
Sahraoui, Vian, et al., 2008
Sahraoui, N.; Vian, M.A.; Bornard, I.; Boutekedjiret, C.; Chemat, F.,
Improved microwave steam distillation apparatus for isolation of essential oils. Comparison with conventional steam distillation,
J. Chromatogr. A., 2008, 1210, 2, 229-233, https://doi.org/10.1016/j.chroma.2008.09.078
. [all data]
Ferhat, Tigrine-Kordjani, et al., 2007
Ferhat, M.A.; Tigrine-Kordjani, N.; Chemat, S.; Meklati, B.Y.; Chemat, F.,
Rapid Extraction of Volatile Compounds Using a New Simultaneous Microwave Distillation: Solvent Extraction Device,
Chromatographia, 2007, 65, 3-4, 217-222, https://doi.org/10.1365/s10337-006-0130-5
. [all data]
Füssel, Dötterl, et al., 2007
Füssel, U.; Dötterl, S.; Jürgens, A.; Aas, G.,
Inter- and intraspecific variation in floral scent in the genus Salix and its implication for pollination,
J. Chem. Ecol., 2007, 33, 4, 749-765, https://doi.org/10.1007/s10886-007-9257-6
. [all data]
Hnawia, Cabalion, et al., 2007
Hnawia, E.; Cabalion, P.; Raunicher, I.; Waikedre, J.; Patissou, J.; Buchbauer, G.; Menut, C.,
The leaf essential oil of Murraya crenulata (Turcz.) Oliver from New Caledonia,
Flavour Fragr. J., 2007, 22, 1, 32-34, https://doi.org/10.1002/ffj.1745
. [all data]
Machado, Bastos, et al., 2007
Machado, C.C.B.; Bastos, D.H.M.; Janzantti, N.S.; Facanali, R.; Marques, M.M.; Franco, M.R.B.,
Determinação do perfil de compostos voláteis e avaliação do sabor e aroma de bebidas produzidas a partir da erva-mate (Ilex paraguariensis),
Quim. Nova, 2007, 30, 3, 513-518, https://doi.org/10.1590/S0100-40422007000300002
. [all data]
Setkova, Risticevic, et al., 2007
Setkova, L.; Risticevic, S.; Pawliszyn, J.,
Rapid headspace solid-phase microextraction-gas chromatographic?time-of-flight mass spectrometric method for qualitative profiling of ice wine volatile fraction II: Classification of Canadian and Czech ice wines using statistical evaluation of the data,
J. Chromatogr. A, 2007, 1147, 2, 224-240, https://doi.org/10.1016/j.chroma.2007.02.052
. [all data]
Tiwary, Nail, et al., 2007
Tiwary, M.; Nail, S.N.; Tewary, D.K.; Mittal, P.K.; Yadav, S.,
Chemical composition and larvicidal activities of the essential oil of Zanthoxylum armatum DC (Rutaceae) against three mosquito vectors,
J. Vect. Borne Dis., 2007, 44, 9, 198-204. [all data]
Vagionas, Graikou, et al., 2007
Vagionas, K.; Graikou, K.; Ngassapa, O.; Runyoro, D.; Chinou, I.,
Composition and antimicrobial activity of the essential oils of three Satureja species growing in Tansania,
Food Chem., 2007, 103, 2, 319-324, https://doi.org/10.1016/j.foodchem.2006.07.051
. [all data]
Bertrand, Comte, et al., 2006
Bertrand, C.; Comte, G.; Piola, F.,
Solid-phase microextraction of volatile compounds from flowers of two Brunfelsia species,
Biochem. Syst. Ecol., 2006, 34, 5, 371-375, https://doi.org/10.1016/j.bse.2005.12.005
. [all data]
Bozin, Mimicá-Dukic, et al., 2006
Bozin, B.; Mimicá-Dukic, N.; Simin, N.; Anackov, G.,
Characterization of the volatile composition of essential oils of some lamiaceae spices and the antimicrobial and antioxidant activities of the entire oils,
J. Agric. Food Chem., 2006, 54, 5, 1822-1828, https://doi.org/10.1021/jf051922u
. [all data]
Castel, Fernandez, et al., 2006
Castel, C.; Fernandez, X.; Lizzani-Cuvelier, L.; Perichet, C.; Lavoine, S.,
Characterization of the Chemical Composition of a Byproduct from Siam Benzoin Gum,
J. Agric. Food Chem., 2006, 54, 23, 8848-8854, https://doi.org/10.1021/jf061193y
. [all data]
Coronel, Cerda-Garcia-Rojas, et al., 2006
Coronel, A. del.C.; Cerda-Garcia-Rojas, C.M.; Joseph-Nathan, P.; Catalán, C.A.N.,
Chemical composition, seasonal variation and a new sesquiterpene alcohol from the essential oil of Lippia integrifolia,
Flavour Fragr. J., 2006, 21, 5, 839-847, https://doi.org/10.1002/ffj.1736
. [all data]
Fernandez, Pintaric, et al., 2006
Fernandez, X.; Pintaric, C.; Lizzani-Cuvelier, L.; Loiseau, A.-M.; Morello, A.; Pellerin, P.,
Chemical composition of absolute and supercritical carbon dioxide extract of Aframomum melegueta,
Flavour Fragr. J., 2006, 21, 1, 162-165, https://doi.org/10.1002/ffj.1554
. [all data]
Javidnia, Miri, et al., 2006
Javidnia, K.; Miri, R.; Kamalinejad, M.; Mehdipour, A.R.,
Composition of the essential oil of Diplotaenia cachrydifolia Boiss. from Iran,
J. Ess. Oil Res., 2006, 18, 1, 86-87, https://doi.org/10.1080/10412905.2006.9699393
. [all data]
Lan Phi N.T., Nishiyama C., et al., 2006
Lan Phi N.T.; Nishiyama C.; Choi H.-S.; Sawamura M.,
Evaluation of aroma characteristic compounds of Citrus natsudaidai Hayata (Natsudaidai) cold-pressed peel oil,
Biosci. Biotechnol. Biochem., 2006, 70, 8, 1832-1838, https://doi.org/10.1271/bbb.50705
. [all data]
Martin, Joseph, et al., 2006
Martin, M.A.C.K.; Joseph, H.; Bercion, S.; Menut, C.,
Chemical composition of essential oils from aerial parts of Aframomum exscapum (Sims) Hepper collected in Guadeloupe, French West Indies,
Flavour Fragr. J., 2006, 21, 6, 902-905, https://doi.org/10.1002/ffj.1741
. [all data]
Marzouk, Mansour, et al., 2006
Marzouk, Z.; Mansour, H.B.; Chraief, I.; Mosrati, R.; Cheriaa, J.; Neffati, A.; Marzouk, B.; Sfari, M.; Boukef, K.; Barillies, D.; Ghedira, L.C.,
Chemical composition, antibacterial and antimutagenic activities of four populations of Rosmarinus officinalis L. oils from Tunisia,
J. Food Agriculture Environment, 2006, 4, 2, 89-94. [all data]
Marzouk, Neffati, et al., 2006
Marzouk, Z.; Neffati, A.; Marzouk, B.; Chraief, I.; Fathia, K.; Ghedira, L.C.; Boukef, K.,
Chemical composition and antibacterial and antimutagenic activity of Tunisian Rosmarinus officinalis L. oil from Kasrine,
Journal of Food, Agriculture Environment, 2006, 4, 34, 61-65. [all data]
Mastelic, Jerkovic, et al., 2006
Mastelic, J.; Jerkovic, I.; Mesic, M.,
Volatile constituents from flowers, leaves, bark and wood of Prunus mahaleb L.,
Flavour Fragr. J., 2006, 21, 2, 306-313, https://doi.org/10.1002/ffj.1596
. [all data]
Morteza-Semnani K., Saeedi M., et al., 2006
Morteza-Semnani K.; Saeedi M.; Changizi S.,
The essential oil composition of Hypericum scabrum L. from Iran,
Flavour Fragr. J., 2006, 21, 3, 513-515, https://doi.org/10.1002/ffj.1614
. [all data]
Orav, Raal, et al., 2006
Orav, A.; Raal, A.; Arak, E.; Müürisepp, M.; Kailas, T.,
Composition of the essential oil of Artemisia absinthium L. of different geographical origin,
Proc. Est. Acad. Sci. Chem., 2006, 55, 3, 155-165. [all data]
Ouamba, Ouabonzi, et al., 2006
Ouamba, J.-M.; Ouabonzi, A.; Ekouya, A.; Bessière, J.-M.; Menut, C.; Abena, A.A.; Banzouzi, J.-T.,
Volatile constituents of the essential oil leaf of Lantana salvifolia Jacq. (Verbenaceae),
Flavour Fragr. J., 2006, 21, 1, 158-161, https://doi.org/10.1002/ffj.1553
. [all data]
Pino, Marquez, et al., 2006
Pino, J.A.; Marquez, E.; Marbot, R.,
Volatile constituents from tea of roselle (Hibiscus sabdariffa L.),
Rev. CENIC Ciencias Quimicas, 2006, 37, 3, 127-129. [all data]
Sabulal, Dan, et al., 2006
Sabulal, B.; Dan, M.; Pradeep, N.S.; Valsamma, R.K.; George, V.,
Composition and antimicrobial activity of essential oil from the fruits of Amomum cannicarpum,
Acta Pharm. Sin., 2006, 56, 473-480. [all data]
Sawamura, Onishi, et al., 2006
Sawamura, M.; Onishi, Y.; Ikemoto, J.; Tu, N.T.M.; Phi, N.T.L.,
Characteristic odour components of bergamot (Citrus bergamia Risso) essential oil,
Flavour Fragr. J., 2006, 21, 4, 609-615, https://doi.org/10.1002/ffj.1604
. [all data]
Senatore, Landolfi, et al., 2006
Senatore, F.; Landolfi, S.; Celik, S.; Bruno, M.,
Volatile components of Centaurea calcitrapa L. and Centaurea sphaerocephala L. ssp. sphaerocephala, two Asteraceae growing wild in Sicily,
Flavour Fragr. J., 2006, 21, 2, 282-285, https://doi.org/10.1002/ffj.1585
. [all data]
Setzer, Noletto, et al., 2006
Setzer, W.N.; Noletto, J.A.; Lawton, R.O.,
Chemical composition of the floral essential oil of Randia matudae from Monteverde, Costa Rica,
Flavour Fragr. J., 2006, 21, 2, 244-246, https://doi.org/10.1002/ffj.1567
. [all data]
Stojanovic, Palic, et al., 2006
Stojanovic, G.; Palic, I.; Ursic-Jankovic, J.,
Composition and antimicrobial activity of the essential oil of Micromeria cristata and Micromeria juliana,
Flavour Fragr. J., 2006, 21, 1, 77-79, https://doi.org/10.1002/ffj.1507
. [all data]
Tigrine-Kordiani, Meklati, et al., 2006
Tigrine-Kordiani, N.; Meklati, B.Y.; Chemat, F.,
Abalysis by gas chromatography - mass spectrometry of the essential oil of Zygophyllum album L., an aromatic and medicinal plant growing in Algeria,
Int. J. Aromatherapy, 2006, 16, 3-4, 187-191, https://doi.org/10.1016/j.ijat.2006.09.008
. [all data]
Wong, Lim, et al., 2006
Wong, K.C.; Lim, T.B.; Ali, D.M.H.,
Essential oil of Homalomena sagittifolia Jungh.,
Flavour Fragr. J., 2006, 21, 5, 786-788, https://doi.org/10.1002/ffj.1714
. [all data]
Chagonda and Chalchat, 2005
Chagonda, L.S.; Chalchat, J.-C.,
The essential oil of wild and cultivated Hoslundia opposita Vahl. from Zimbabwe,
Flavour Fragr. J., 2005, 20, 2, 193-195, https://doi.org/10.1002/ffj.1402
. [all data]
Fakhari, Salehi, et al., 2005
Fakhari, A.R.; Salehi, P.; Heydari, R.; Ebrahimi, S.N.; Haddad, P.R.,
Hydrodistillation-headspace solvent microextraction, a new method for analysis of the essential oil components of Lavandula angustifolia Mill.,
J. Chromatogr. A, 2005, 1098, 1-2, 14-18, https://doi.org/10.1016/j.chroma.2005.08.054
. [all data]
Gauvin and Smadja, 2005
Gauvin, A.; Smadja, J.,
Essential oil composition of four Psiadia species from Reunion Island: A chemotaxonomic study,
Biochem. Syst. Ecol., 2005, 33, 7, 705-714, https://doi.org/10.1016/j.bse.2004.12.013
. [all data]
Kilic, Kollmannsberger, et al., 2005
Kilic, A.; Kollmannsberger, H.; Nitz, S.,
Glycosidically bound volatiles and flavor precursors in Laurus nobilis L.,
J. Agric. Food Chem., 2005, 53, 6, 2231-2235, https://doi.org/10.1021/jf040373+
. [all data]
Leffingwell and Alford, 2005
Leffingwell, J.C.; Alford, E.D.,
Volatile constituents of Perique tobacco,
Electron. J. Environ. Agric. Food Chem., 2005, 4, 2, 899-915. [all data]
Nyegue, Belinga-Ndoye, et al., 2005
Nyegue, M.A.; Belinga-Ndoye, C.F.; Amvam Zollo, P.H.; Agnaniet, H.; Menut, C.; Bessière, J.M.,
Aromatic plants of tropical central Africa. Part L. Volatile components of Clerodendrum buchholzii Gürke from Cameroon,
Flavour Fragr. J., 2005, 20, 3, 321-323, https://doi.org/10.1002/ffj.1424
. [all data]
de Oliveira, Dias, et al., 2005
de Oliveira, R.N.; Dias, I.J.M.; Câmara, C.A.G.,
Estudo comparativo do óleo essencial de Eugenia punicifolia (HBK) DC. de diferentes localidades de Pernambuco,
Rev. Bras. Farmacogn., 2005, 15, 1, 39-43, https://doi.org/10.1590/S0102-695X2005000100009
. [all data]
Palá-Paúl, Pérez-Alonso, et al., 2005
Palá-Paúl, J.; Pérez-Alonso, M.; Velasco-Negueruela, A.; Vadaré, J.; Villa, A.M.; Sanz, J.; Brophy, J.J.,
Analysis of the essential oil composition from the different parts of Eryngium glaciale Boiss. from Spain,
J. Chromatogr. A, 2005, 1094, 1-2, 179-182, https://doi.org/10.1016/j.chroma.2005.09.029
. [all data]
Pellati, Benvenuti, et al., 2005
Pellati, F.; Benvenuti, S.; Yoshizaki, F.; Bertelli, D.; Rossi, M.C.,
Headspace solid-phase microextraction-gas chromatography-mass spectrometry analysis of the volatile compounds of Evodia species fruits,
J. Chromatogr. A, 2005, 1087, 1-2, 265-273, https://doi.org/10.1016/j.chroma.2005.01.060
. [all data]
Setzer, Noletto, et al., 2005
Setzer, W.N.; Noletto, J.A.; Lawton, R.O.; Haber, W.A.,
Leaf essential oil composition of five Zanthoxylum species from Monteverde, Costa Rica,
Molecular Diversity, 2005, 9, 1-3, 3-13, https://doi.org/10.1007/s11030-005-1298-6
. [all data]
da Silva, Andrade, et al., 2005
da Silva, M.H.L.; Andrade, E.H.A.; Mala, J.G.S.,
The essential oil of Pectis elongata Kunth occurring in north Brazil,
Flavour Fragr. J., 2005, 20, 5, 462-464, https://doi.org/10.1002/ffj.1546
. [all data]
Slavkovska, Couladis, et al., 2005
Slavkovska, V.; Couladis, M.; Bojovic, S.; Tzakou, O.; Pavlovic, M.; Lakusic, B.; Jancic, R.,
Essential oil and its systematic significance in species of Micromeria Bentham from Serbia Montenegro,
Plant Systematics and Evolution, 2005, 255, 1-2, 1-15, https://doi.org/10.1007/s00606-005-0303-y
. [all data]
Suárez, Vásquez, et al., 2005
Suárez, A.I.; Vásquez, L.J.; Manzano, M.A.; Compagnone, R.S.,
Essential oil composition of Croton cuneatus and Croton malambo growing in Venezuela,
Flavour Fragr. J., 2005, 20, 6, 611-614, https://doi.org/10.1002/ffj.1498
. [all data]
Tesevic, Nikicevic, et al., 2005
Tesevic, V.; Nikicevic, N.; Jovanovic, A.; Djokovic, D.; Vujisic, L.; Vuckovic, I.; Bonic, M.,
Volatile components from old plum brandies,
Food Technol. Biotechnol., 2005, 43, 4, 367-372. [all data]
Wong and Tan, 2005
Wong, K.C.; Tan, C.H.,
Volatile constituents of the flowers of Clerodendron fragrans (Vent.) R. Br.,
Flavour Fragr. J., 2005, 20, 4, 429-430, https://doi.org/10.1002/ffj.1457
. [all data]
Jürgens and Dötterl, 2004
Jürgens, A.; Dötterl, S.,
Chemical composition of anther volatiles in Ranunculaceae: genera-specific profiles in Aemone, Aquilegia, Caltha, Pulsatilla, Ranunculus, and Trollius species,
American Journal of Botany, 2004, 91, 12, 1969-1980, https://doi.org/10.3732/ajb.91.12.1969
. [all data]
paz Lima, Silva, et al., 2004
paz Lima, M.; Silva, T.M.D.; da Silva, J.D.; Zoghbi, M.G.B.; Andrade, E.H.A.,
Essential oil composition of leaf and fine stem of Aniba canelilla (Kunth) Mez from Manaus, Brazil.,
Acta Amazonica, 2004, 34, 2, 329-330, https://doi.org/10.1590/S0044-59672004000200019
. [all data]
Park, Lee, et al., 2004
Park, B.-S.; Lee, K.-G.; Takeoka, G.R.,
Comparison of three sample preparation methods on the recovery of volatiles from taheebo (Tabebuia impetiginosa Martius ex DC),
Flavour Fragr. J., 2004, 19, 4, 287-292, https://doi.org/10.1002/ffj.1345
. [all data]
Raal, Arak, et al., 2004
Raal, A.; Arak, E.; Orav, A.,
Chemical composition of coriander seed essential oil and their conformity with EP standards,
Agraarteadus, 2004, 15, 4, 234-239. [all data]
Senatore, Napolitano, et al., 2004
Senatore, F.; Napolitano, F.; Mohamed, M.A.-H.; Harris, P.J.C.; MnKeni, P.N.S.; Henderson, J.,
Antibacterial activity of Tagetes minuta L. (Asteraceae) essential oil with different chemical composition,
Flavour Fragr. J., 2004, 19, 6, 574-578, https://doi.org/10.1002/ffj.1358
. [all data]
Shafi, Nambiar, et al., 2004
Shafi, P.M.; Nambiar, M.K.G.; Clery, R.A.; Sarma, Y.R.; Veena, S.S.,
Composition and antifungal activity of the oil of Artemisia nilagirica (Clarke) Pamp,
J. Essent. Oil Res., 2004, 16, 4, 377-379, https://doi.org/10.1080/10412905.2004.9698748
. [all data]
Simic, Sokovic, et al., 2004
Simic, A.; Sokovic, M.D.; Ristic, M.; Grujic-Jovanovic, S.; Vukojevic, J.; Marin, P.D.,
The chemical composition of some Lauraceae essential oils and their antifungal activities,
Phytother. Res., 2004, 18, 9, 713-717, https://doi.org/10.1002/ptr.1516
. [all data]
Vilaseca, Guy, et al., 2004
Vilaseca, A.; Guy, I.; Charles, B.; Guinaudeau, H.; de Arias, A.R.; Fournet, A.,
Chemical composition and insecticidal activity of Hedeoma mandoniana essential oils,
J. Essent. Oil Res., 2004, 16, 4, 380-383, https://doi.org/10.1080/10412905.2004.9698749
. [all data]
Woerdenbag, Windono, et al., 2004
Woerdenbag, H.J.; Windono, T.; Bos, R.; Riswan, S.; Quax, W.J.,
Composition of the essential oils of Kaempferia rotunda L. and Kaempferia angustifolia Roscoe rhizomes from Indonesia,
Flavour Fragr. J., 2004, 19, 2, 145-148, https://doi.org/10.1002/ffj.1284
. [all data]
Agnaniet, Mounzeo, et al., 2003
Agnaniet, H.; Mounzeo, H.; Menut, C.; Bessiere, J.-M.; Criton, M.,
The essential oils of Rinorea subintegrifolia O. Ktze and Drypetes gossweileri S. Moore occurring in Gabon,
Flavour Fragr. J., 2003, 18, 3, 207-210, https://doi.org/10.1002/ffj.1185
. [all data]
Ghannadi, Aghazari, et al., 2003
Ghannadi, A.; Aghazari, F.; Mehrabani, M.; Mohagheghzadeh, A.; Mehregan, I.,
Quantity and composition of the SDE prepared essential oil of Nepeta macrosiphon Boiss,
Iran. J. Pharm. Res., 2003, 2, 103-105. [all data]
Jirovetz, Buchbauer, et al., 2003
Jirovetz, L.; Buchbauer, G.; Shafi, M.P.; Kaniampady, M.M.,
Chemotaxonomical analysis of the essential oil aroma compounds of four different Ocimumspecies from southern India,
Eur. Food Res. Technol., 2003, 217, 2, 120-124, https://doi.org/10.1007/s00217-003-0708-1
. [all data]
Jirovetz, Buchbauer, et al., 2003, 2
Jirovetz, L.; Buchbauer, G.; Shafi, M.P.; Leela, N.K.,
Analysis of the essential oils of the leaves, stems, rhizomes and roots of the medicinal plant Alpinia galanga from southern India,
Acta Pharm. Hung., 2003, 53, 73-81. [all data]
Ledauphin, Guichard, et al., 2003
Ledauphin, J.; Guichard, H.; Saint-Clair, J.-F.; Picoche, B.; Barillier, D.,
Chemical and sensorial aroma characterization of freshly distilled calvados. 2. Identification of volatile compounds and key odorants,
J. Agric. Food Chem., 2003, 51, 2, 433-442, https://doi.org/10.1021/jf020373e
. [all data]
Mookdasanit, Tamura, et al., 2003
Mookdasanit, J.; Tamura, H.; Yoshizawa T.; Tokunaga T.; Nakanishi, K.,
Trace Volatile Compounds in Essential Oil of Citrus Sudachi by Means of Modified Solvent Extraction Method,
Food Sci Technol. Res., 2003, 9, 1, 54-61, https://doi.org/10.3136/fstr.9.54
. [all data]
Pino, Marbot, et al., 2003, 2
Pino, J.A.; Marbot, R.; Fuentes, V.,
Characterization of volatiles in Bullock's heart (Annona reticulata L.) fruit cultivars from Cuba,
J. Agric. Food Chem., 2003, 51, 13, 3836-3839, https://doi.org/10.1021/jf020733y
. [all data]
Velickovic, Randjelovic, et al., 2003
Velickovic, D.T.; Randjelovic, N.V.; Ristic, M.S.; Velickovic, A.S.; Smelcerovic, A.A.,
Chemical constituents and antimicrobial activity of the ethanol extracts obtained from the flower, leaf, and stem of Salvia officinalis L.,
J. Serb. Chem. Soc., 2003, 68, 1, 17-24, https://doi.org/10.2298/JSC0301017V
. [all data]
Boyom, Keumedjio, et al., 2002
Boyom, F.F.; Keumedjio, F.; Dongmo, P.M.J.; Ngadjui, B.T.; Zollo, A.; Menut, C.; Bessiere, J.M.,
Essential oils from Croton zambesicus Muell. Arg. growing in Cameroon,
Flavour Fragr. J., 2002, 17, 3, 215-217, https://doi.org/10.1002/ffj.1081
. [all data]
Caredda, Marongiu, et al., 2002
Caredda, A.; Marongiu, B.; Porcedda, S.; Soro, C.,
Supercritical carbon dioxide extraction and characterization of Laurus nobilis essential oil,
J. Agric. Food Chem., 2002, 50, 6, 1492-1496, https://doi.org/10.1021/jf0108563
. [all data]
Lin, Rouseff, et al., 2002
Lin, J.; Rouseff, R.L.; Barros, S.; Naim, M.,
Aroma composition changes in early season grapefruit juice produced from thermal concentration,
J. Agric. Food Chem., 2002, 50, 4, 813-819, https://doi.org/10.1021/jf011154g
. [all data]
Orav, Kailas, et al., 2002
Orav, A.; Kailas, T.; Müürisepp, M.,
Composition of blackcurrant aroma isolated from leaves, buds, and berries of Ribes nigrum L.,
Proc. Est. Acad. Sci. Chem., 2002, 51, 4, 225-234. [all data]
Schwob, Bessière, et al., 2002
Schwob, I.; Bessière, J.-M.; Viano, J.,
Composition of the essential oils of Hypericum perforatum L. from southeastern France,
C.R. Acad. Sci. Ser. 3:, 2002, 325, 781-785. [all data]
Brun, Bessière, et al., 2001
Brun, G.; Bessière, J.-M.; Dijoux-Franca, M.-G.; David, B.; Mariotte, A.-M.,
Volatile components of Catharanthus roseus (L.) G. Don (Apocynaceae),
Flavour Fragr. J., 2001, 16, 2, 116-119, https://doi.org/10.1002/ffj.958
. [all data]
Fernando and Grün, 2001
Fernando, L.N.; Grün, I.U.,
Headspace-SPME analysis of volatiles of the ridge gourd (Luffa acutangula) and bitter gourd (Momordica charantia) flowers,
Flavour Fragr. J., 2001, 16, 4, 289-293, https://doi.org/10.1002/ffj.999
. [all data]
Gupta, Mallavarapu, et al., 2001
Gupta, R.; Mallavarapu, G.R.; Banerjee, S.; Kumar, S.,
Characteristics of an isomenthone-rich somaclonal mutant isolated in a geraniol-rich rose-scented geranium accession of Pelargonium graveolens,
Flavour Fragr. J., 2001, 16, 5, 319-324, https://doi.org/10.1002/ffj.1002
. [all data]
Yang, 2001
Yang, R.,
Analysis of the volatile components in peel oil of Yuzu by gas chromatography/mass spectrometry,
Chin. J. Anal. Chem., 2001, 29, 3, 313-316. [all data]
Yang, 2001, 2
Yang, R.,
Volatile compounds in peel oil of Citrus sudachi,
Food Sci. (Beijing), 2001, 22, 3, 71-73. [all data]
de Beck, Bessière, et al., 2000
de Beck, P.O.; Bessière, J.M.; Dijoux-Franca, M.-G.; David, B.; Mariotte, A.-M.,
Volatile constituents from leaves and wood of Leea guineensis G. Don (Leeaceae) from Cameroon,
Flavour Fragr. J., 2000, 15, 3, 182-185, https://doi.org/10.1002/1099-1026(200005/06)15:3<182::AID-FFJ888>3.0.CO;2-X
. [all data]
Mohagheghzadeh, Shams-Ardakani, et al., 2000
Mohagheghzadeh, A.; Shams-Ardakani, M.; Ghannadi, A.,
Linalol-rich essential oil of Zataria multiflora Boiss. (Lamiaceae),
Flavour Fragr. J., 2000, 15, 2, 119-122, https://doi.org/10.1002/(SICI)1099-1026(200003/04)15:2<119::AID-FFJ878>3.0.CO;2-V
. [all data]
Simic, Andjelkovic, et al., 2000
Simic, N.; Andjelkovic, S.; Palic, R.; Vajs, V.; Milosavljevic, S.,
Volatile constituents of Achillea serbica Nym.,
Flavour Fragr. J., 2000, 15, 3, 141-143, https://doi.org/10.1002/1099-1026(200005/06)15:3<141::AID-FFJ881>3.0.CO;2-O
. [all data]
Menon, Chacko, et al., 1999
Menon, A.N.; Chacko, S.; Narayanan, C.S.,
Free and glycosidically bound volatiles of cardamom (Eletteria cardamomum Maton var. miniscula Burkill),
Flavour Fragr. J., 1999, 14, 1, 65-68, https://doi.org/10.1002/(SICI)1099-1026(199901/02)14:1<65::AID-FFJ789>3.0.CO;2-A
. [all data]
Ong and Acree, 1999
Ong, P.K.C.; Acree, T.E.,
Similarities in the aroma chemistry of Gewürztraminer variety wines and lychee (Litchi chinesis Sonn.) fruit,
J. Agric. Food Chem., 1999, 47, 2, 665-670, https://doi.org/10.1021/jf980452j
. [all data]
Shafiee, Javidnia, et al., 1999
Shafiee, A.; Javidnia, K.; Tabatabai, M.,
Volatile constituents and antimicrobial activity of zataria multiflora, population Iran,
Iran J. Chem. Chem. Eng., 1999, 18, 1, 1-5. [all data]
Sun and Petracek, 1999
Sun, D.; Petracek, P.D.,
Grapefruit gland oil composition is affected by wax application, storage temperature, and storage time,
J. Agric. Food Chem., 1999, 47, 5, 2067-2069, https://doi.org/10.1021/jf981064k
. [all data]
Jantan, Ahmad, et al., 1998
Jantan, I.; Ahmad, A.S.; Bakar, S.A.A.; Ahmad, A.R.; Trockenbrodt, M.; Chak, C.V.,
Constituents of the essential oil of Baeckea frutescens L. from Malaysia,
Flavour Fragr. J., 1998, 13, 4, 245-247, https://doi.org/10.1002/(SICI)1099-1026(1998070)13:4<245::AID-FFJ736>3.0.CO;2-J
. [all data]
Lamarque, Maestri, et al., 1998
Lamarque, A.L.; Maestri, D.M.; Zygadlo, J.A.; Grosso, N.R.,
Volatile constituents from flowers of Acacia caven (Mol.) Mol. var. caven, Acacia aroma Gill. ex Hook., Erythrina crista-galli L. and Calliandra tweedii Benth.,
Flavour Fragr. J., 1998, 13, 4, 266-268, https://doi.org/10.1002/(SICI)1099-1026(1998070)13:4<266::AID-FFJ739>3.0.CO;2-5
. [all data]
Ong and Acree, 1998
Ong, P.K.C.; Acree, T.E.,
Gas chromatography/olfactory analysis of lychee (Litchi chinesis Sonn.),
J. Agric. Food Chem., 1998, 46, 6, 2282-2286, https://doi.org/10.1021/jf9801318
. [all data]
Ong, Acree, et al., 1998
Ong, P.K.C.; Acree, T.E.; Lavin, E.H.,
Characterization of volatiles in rambutan fruit (Nephelium lappaceum L.),
J. Agric. Food Chem., 1998, 46, 2, 611-615, https://doi.org/10.1021/jf970665t
. [all data]
D'Arcy, Rintoul, et al., 1997
D'Arcy, B.R.; Rintoul, G.B.; Rowland, C.Y.; Blackman, A.J.,
Composition of Australian honey extractives. 1. Norisoprenoids, monoterpenes, and other natural volatiles from blue gum (Eucalyptus leucoxylon) and yellow box (Eucalyptus melliodora) honeys,
J. Agric. Food Chem., 1997, 45, 5, 1834-1843, https://doi.org/10.1021/jf960625+
. [all data]
Chacko, Jayalekshmy, et al., 1996
Chacko, S.; Jayalekshmy, A.; Gopalakrishnan, M.; Narayanan, C.S.,
Roasting studies on black pepper (Piper nigrum L.),
Flavour Fragr. J., 1996, 11, 5, 305-310, https://doi.org/10.1002/(SICI)1099-1026(199609)11:5<305::AID-FFJ588>3.0.CO;2-1
. [all data]
Wong and Lai, 1996
Wong, K.C.; Lai, F.Y.,
Volatile constituents from the fruits of four Syzygium species grown in Malaysia,
Flavour Fragr. J., 1996, 11, 1, 61-66, https://doi.org/10.1002/(SICI)1099-1026(199601)11:1<61::AID-FFJ539>3.0.CO;2-1
. [all data]
Gopalakrishnan, Menon, et al., 1993
Gopalakrishnan, M.; Menon, N.; Padmakumari, K.P.; Jayalekshmy, A.; Narayanan, C.S.,
GC Analysis and Odor Profiles of Four New Indian Genotypes of Piper nigrum L.,
J. Essent. Oil Res., 1993, 5, 3, 247-253, https://doi.org/10.1080/10412905.1993.9698217
. [all data]
Tamura, Yang, et al., 1993
Tamura, H.; Yang, R.-H.; Sugisawa, H.,
Aroma profiles of peel oils of acid citrus,
ACS Sym. Ser., 1993, 525, 121-136. [all data]
Velasco-Negueruela, Pérez Alonso, et al., 1991
Velasco-Negueruela, A.; Pérez Alonso, M.J.; Burzaco, A.,
Aceites esenciales de tomillos ibéricos. VI. Contribución al conocimiento del aceite esencial de thymus capitellatus Hoffmanns. Link,
Anales Jard. Bot. Madrid, 1991, 49, 1, 77-81. [all data]
Buttery, Takeoka, et al., 1990
Buttery, R.G.; Takeoka, G.; Teranishi, R.; Ling, L.C.,
Tomato aroma components: identification of glycoside hydrolysis volatiles,
J. Agric. Food Chem., 1990, 38, 11, 2050-2053, https://doi.org/10.1021/jf00101a010
. [all data]
Yang and Sugisawa, 1990
Yang, R.; Sugisawa, H.,
Citrus Suachi Hort. ex Shirai. Volatile components in Sudachi (Citrus Sudachi Hort. ex Shirai) juice,
Nippon Shokuhin Kogyo Gakkaishi, 1990, 37, 12, 946-952, https://doi.org/10.3136/nskkk1962.37.12_946
. [all data]
Sugisawa, Yamamoto, et al., 1989
Sugisawa, H.; Yamamoto, M.; Tamura, H.; Takagi, N.,
The comparison of volatile components in peel oil from four species of navel orange,
Nippon Shokuhin Kogio Gakkaishi, 1989, 36, 6, 455-462, https://doi.org/10.3136/nskkk1962.36.6_455
. [all data]
Sugisawa, Yang, et al., 1989
Sugisawa, H.; Yang, R.H.; Kawabata, C.; Tamura, H.,
Volatile constituents in the peel oil of sudachi (Citrus sudachi),
Agric. Biol. Chem., 1989, 53, 6, 1721-1723, https://doi.org/10.1271/bbb1961.53.1721
. [all data]
Georgilopoulos and Gallois, 1988
Georgilopoulos, D.N.; Gallois, A.N.,
Flavour compounds of a commercial concentrated blackberry juice,
Food Chem., 1988, 28, 2, 141-148, https://doi.org/10.1016/0308-8146(88)90143-4
. [all data]
Nykanen, 1986
Nykanen, I.,
High Resolution Gas Chromatographic - Mass Spectrometric determination of the Flavour Composition of Wild Majoram (Origanum vulgare L.) Cultivated in Finland,
Z. Lebensm Unters Forsch, 1986, 183, 4, 267-272, https://doi.org/10.1007/BF01087742
. [all data]
Habu, Flath, et al., 1985
Habu, T.; Flath, R.A.; Mon, T.R.; Morton, J.F.,
Volatile components of Rooibos tea (Aspalathus linearis),
J. Agric. Food Chem., 1985, 33, 2, 249-254, https://doi.org/10.1021/jf00062a024
. [all data]
Flath, Mon, et al., 1983
Flath, R.A.; Mon, T.R.; Lorenz, G.; Whitten, C.J.; Mackley, J.W.,
Volatile components of Acacia sp. blossoms,
J. Agric. Food Chem., 1983, 31, 6, 1167-1170, https://doi.org/10.1021/jf00120a008
. [all data]
Alves and Jennings, 1979
Alves, S.; Jennings, W.G.,
Volatile composition of certain Amazonian fruits,
Food Chem., 1979, 4, 2, 149-159, https://doi.org/10.1016/0308-8146(79)90039-6
. [all data]
Di Giusto, Bessiere, et al., 2010
Di Giusto, B.; Bessiere, J.-M.; Gueroult, M.; Lim, L.B.L.; Marshall, D.J.; Hossaert-McKey, M.; Gaume, L.,
Flower-scent mimicry masks a deadly trap in the carnivorous plant Nepenthes raffesiana,
J. Ecology, 2010, 98, 4, 845-856, https://doi.org/10.1111/j.1365-2745.2010.01665.x
. [all data]
Courtois, Paine, et al., 2009
Courtois, E.A.; Paine, C.E.; Blandinieres, P.-A.; Stien, D.; Bessiere, J.-M.; Houel, E.; Baraloto, C.; Chave, J.,
Diversity of the volatile organic compounds emitted by 55 species of tropical trees: a survey in French Guiana,
J. Chem. Ecol., 2009, 35, 11, 1349-1362, https://doi.org/10.1007/s10886-009-9718-1
. [all data]
Delort and Jaquier, 2009
Delort, E.; Jaquier, A.,
Novel terpenyl esters from Australian finger lime (Citrus australasica) peel extract,
Flav. Fragr. J., 2009, 24, 3, 123-132, https://doi.org/10.1002/ffj.1922
. [all data]
Riahi, Pourbasheer, et al., 2009
Riahi, S.; Pourbasheer, E.; Ganjali, M.R.; Norouzi, P.,
Investigation of different linear and non-linear chemometric methods for modeling of retention index of essential oil components: Concerns to support vector mashine,
J. Hazard. Mat., 2009, 166, 2-3, 853-859, https://doi.org/10.1016/j.jhazmat.2008.11.097
. [all data]
Kannaste, Vongvanich, et al., 2008
Kannaste, A.; Vongvanich, N.; Borg-Karlson, A.-K.,
Infestation by a Nalepella species induces emissions of alpha- and beta-farnesenes, (-)-linalool and aromatic compounds in Norway spruce clones of different susceptibility to the large pine weevil,
Anthropod-Plant Interactions, 2008, 2, 1, 31-41, https://doi.org/10.1007/s11829-008-9029-4
. [all data]
Kristiawan, Sobolik, et al., 2008
Kristiawan, M.; Sobolik, V.; Al-Haddad, M.; Allaf, K.,
Effect of pressure-drop rate on the isolation of cananga oil using instantaneous controlled pressure-drop process,
Chem. Eng. Processing, 2008, 47, 1, 66-75, https://doi.org/10.1016/j.cep.2007.08.011
. [all data]
Ning, Zheng, et al., 2008
Ning, H.; Zheng, F.; Sun, B.; Xie, J.; Liu, Y.,
Solvent-free microwave extraction of essential oil from Zanthoxylum bungeanum Maxim.,
Food Environ. Ind. (Chinese), 2008, 34, 5, 179-184. [all data]
Zhao, Li, et al., 2008
Zhao, Y.; Li, J.; Xu, Y.; Duan, H.; Fan, W.; Zhao, G.,
EXtraction, preparation and identification of volatile compounds in Changyu XO brandy,
Chinese J. Chromatogr., 2008, 26, 2, 212-222, https://doi.org/10.1016/S1872-2059(08)60014-0
. [all data]
Zhu, Li, et al., 2008
Zhu, M.; Li, E.; He, H.,
Determination of volatile chemical constitutes in tea by simultaneous distillation extraction, vacuum hydrodistillation and thermal desrption,
Chromatographia, 2008, 68, 7/8, 603-610, https://doi.org/10.1365/s10337-008-0732-1
. [all data]
Cole, Haber, et al., 2007
Cole, R.A.; Haber, W.A.; Setzer, W.N.,
Chemical composition of essential oils of seven species of Eugenia from Monteverde, Costa Rica,
Biochem. Syst. Ecol., 2007, 35, 12, 877-886, https://doi.org/10.1016/j.bse.2007.06.013
. [all data]
Kamatou, Viljoen, et al., 2007
Kamatou, G.P.P.; Viljoen, A.M.; Figueiredo, A.C.; Tilney, P.M.; Van Zyl, R.L.; Barroso, J.G.; Pedro, L.G.; Van Vuuren, S.F.,
Trichomes, essential oil composition and biological activities of Salvia albanicus Benth. and S. dolomitica Codd, two species from the Cape region of Soith Africa,
South African J. Botany, 2007, 73, 1, 102-108, https://doi.org/10.1016/j.sajb.2006.08.001
. [all data]
Meekijjaroenroj, Bessière, et al., 2007
Meekijjaroenroj, A.; Bessière, J.-M.; Anstett, M.-C.,
Chemistry of floral scents in four Licuala species (Arecaceae),
Flavour Fragr. J., 2007, 22, 4, 300-310, https://doi.org/10.1002/ffj.1797
. [all data]
Proffit, 2007
Proffit, M.,
Mediation chimique et structuration des communautes d'hymenopteres parasites du mutualisme figuier / pollinisateur (These pour obtenir le grade de Docteur de l'Universite Montpellier II) (Dissertation), 2007. [all data]
Salamci, Kordali, et al., 2007
Salamci, E.; Kordali, S.; Kotan, R.; Cakir, A.; Kaya, Y.,
Chemical compositions, antimicrobial and herbicidal effects of essential oils isolated from Turkish Tanacetum aucheranum and Tanacetum chiliophyllum var. chiliophyllum,
Biochem. Syst. Ecol., 2007, 35, 9, 569-581, https://doi.org/10.1016/j.bse.2007.03.012
. [all data]
Schmidt, Noletto, et al., 2006
Schmidt, J.M.; Noletto, J.A.; Vogler, B.; Setzer, W.N.,
Abaco Bush Medicine: Chemical composition of the essential oils of four aromatic medicinal plants from Abaco Island, Bahamas,
J. Herbs, Spices Medicinal Plants, 2006, 12, 3, 43-65, https://doi.org/10.1300/J044v12n03_04
. [all data]
Singh G., Maurya S., et al., 2006
Singh G.; Maurya S.; de Lampasona M.P.; Catalan C.A.N.,
Studies on essential oils, Part 41. Chemical composition, antifungal, antioxidant and sprout suppressant activities of coriander (Coriandrum sativum) essential oil and its oleoresin,
Flavour Fragr. J., 2006, 21, 3, 472-479, https://doi.org/10.1002/ffj.1608
. [all data]
Miguel, Simões, et al., 2004
Miguel, G.; Simões, M.; Figueiredo, A.C.; Barroso, J.G.; Pedro, L.G.; Carvalho, L.,
Composition and antioxidant activities of the essential oils of Thymus caespititius, Thymus camphoratus and Thymus mastichina,
Food Chem., 2004, 86, 2, 183-188, https://doi.org/10.1016/j.foodchem.2003.08.031
. [all data]
Sahin, Gulluce, et al., 2004
Sahin, F.; Gulluce, M.; Daferera, D.; Sokmen, A.; Sokmen, M.; Polissiou, M.; Agar, G.; Ozer, H.,
Biological activities of the essential oils and methanol extract of Origanum vulgare ssp. vulgare in the Eastern Anatolia region of Turkey,
Food Control, 2004, 15, 7, 549-557, https://doi.org/10.1016/j.foodcont.2003.08.009
. [all data]
Vinogradov, 2004
Vinogradov, B.A.,
Production, composition, properties and application of essential oils, 2004, retrieved from http://viness.narod.ru. [all data]
Silva, Matos, et al., 2003
Silva, M.G.V.; Matos, F.J.A.; Machado, M.I.L.; Craveiro, A.A.,
Essential oils of Ociumum basilicum L., O. basilicum. var. minimum L. and O. basilicum. var. purpurascens Benth. grown in north-eastern Brazil,
Flavour Fragr. J., 2003, 18, 1, 13-14, https://doi.org/10.1002/ffj.1134
. [all data]
Figueiredo, Miguel, et al., 2001
Figueiredo, A.C.; Miguel, M.G.; Duarte, A.M.F.; Barroso, J.G.; Pedro, L.G.,
Essential oil composition of Thymus lotocephallus G. López R. Morales, collected during flowering and vegetative phases,
Flavour Fragr. J., 2001, 16, 6, 417-421, https://doi.org/10.1002/ffj.1028
. [all data]
Weyerstahl, Marschall, et al., 1999
Weyerstahl, P.; Marschall, H.; Splittgerber, U.; Son, P.T.; Giang, P.M.; Kaul, V.K.,
Constituents of the essential oil from the fruits of Zanthoxylum rhetsoides Drake from Vietnam and from the aerial parts of Zanthoxylum alatum Roxb. from India,
Flavour Fragr. J., 1999, 14, 4, 225-229, https://doi.org/10.1002/(SICI)1099-1026(199907/08)14:4<225::AID-FFJ818>3.0.CO;2-1
. [all data]
Weyerstahl, Marschall, et al., 1998
Weyerstahl, P.; Marschall, H.; Weirauch, M.; Thefeld, K.; Surburg, H.,
Constituents of commercial Labdanum oil,
Flavour Fragr. J., 1998, 13, 5, 295-318, https://doi.org/10.1002/(SICI)1099-1026(1998090)13:5<295::AID-FFJ751>3.0.CO;2-I
. [all data]
Weyerstahl, Marschall, et al., 1998, 2
Weyerstahl, P.; Marschall, H.; Thefeld, K.; Subba, G.C.,
Constituents of the essential oil from the rhizomes of Hedychium gardnerianum Roscoe,
Flavour Fragr. J., 1998, 13, 6, 377-388, https://doi.org/10.1002/(SICI)1099-1026(199811/12)13:6<377::AID-FFJ755>3.0.CO;2-F
. [all data]
Anitescu, Doneanu, et al., 1997
Anitescu, G.; Doneanu, C.; Radulescu, V.,
Isolation of Coriander oil: comparison between steam distillation and supercritical CO2 extraction,
Flavour Fragr. J., 1997, 12, 3, 173-176, https://doi.org/10.1002/(SICI)1099-1026(199705)12:3<173::AID-FFJ630>3.0.CO;2-1
. [all data]
Gaspar, Palma, et al., 1997
Gaspar, H.; Palma, F.M.S.B.; de la Torre, M.C.; Rodríguez, B.; Barroso, J.G.; Figueiredo, A.C.,
Composition of the essential oil of Teucrium haenseleri Boiss.,
Flavour Fragr. J., 1997, 12, 5, 355-357, https://doi.org/10.1002/(SICI)1099-1026(199709/10)12:5<355::AID-FFJ656>3.0.CO;2-B
. [all data]
Zhao, Xu, et al., 2009
Zhao, Y.; Xu, Y.; Li, J.; Fan, W.; Jiang, W.,
Profile of volatile compounds in 11 brandies by headspace solid-phase microextraction followed by gas chromatography-mass spectrometry,
J. Food. Sci., 2009, 74, 2, c90-c99, https://doi.org/10.1111/j.1750-3841.2008.01029.x
. [all data]
Soria, Sanz, et al., 2008
Soria, A.C.; Sanz, J.; Martinez-Castro, I.,
SPME followed by GC-MS: a powerful technique for qualitative analysis of honey volatiles,
Eur. Food Res. Technol., 2008, 1-12. [all data]
Kurose, Okamura, et al., 2007
Kurose, K.; Okamura, D.; Yatagai, M.,
Composition of the essential oils from the leaves of nine Pinus species and the cones of three of Pinus species,
Flavour Fragr. J., 2007, 22, 1, 10-20, https://doi.org/10.1002/ffj.1609
. [all data]
Vichi, Riu-Aumatell, et al., 2007
Vichi, S.; Riu-Aumatell, M.; Mora-Pons, M.; Guadayol, J.M.; Buxaderas, S.; López-Tamames, E.,
Analytical, Nutritional and Clinical Methods. HS-SPME coupled to GC/MS for quality control of Juniperus communis L. berries used for gin aromatization,
Food Chem., 2007, 105, 4, 1748-1754, https://doi.org/10.1016/j.foodchem.2007.03.026
. [all data]
Cai, Lin, et al., 2006
Cai, J.; Lin, P.; Zhu, X.; Su, Q.,
Comparative analysis of clary sage (S. sclarea L.) oil volatiles by GC-FTIR and GC-MS,
Food Chem., 2006, 99, 2, 401-407, https://doi.org/10.1016/j.foodchem.2005.07.041
. [all data]
Ibarz, Ferreira, et al., 2006
Ibarz, M.J.; Ferreira, V.; Hernández-Orte, P.; Loscos, N.; Cacho, J.,
Optimization and evaluation of a procedure for the gas chromatographic-mass spectrometric analysis of the aromas generated by fast acid hydrolysis of flavor precursors extracted from grapes,
J. Chromatogr. A, 2006, 1116, 1-2, 217-229, https://doi.org/10.1016/j.chroma.2006.03.020
. [all data]
Wong, Sivasothy, et al., 2006
Wong, K.C.; Sivasothy, Y.; Boey, P.L.,
Essential oil of Elettariopsis elan C.K. Lim,
Flavour Fragr. J., 2006, 21, 3, 562-564, https://doi.org/10.1002/ffj.1654
. [all data]
Babu and Kaul, 2005
Babu, K.G.D.; Kaul, V.K.,
Variation in essential oil composition of rose-scented geranium (Pelargonium sp.) distilled by different distillation techniques,
Flavour Fragr. J., 2005, 20, 2, 222-231, https://doi.org/10.1002/ffj.1414
. [all data]
de la Fuente, Martinez-Castro, et al., 2005
de la Fuente, E.; Martinez-Castro, I.; Sanz, J.,
Characterization of Spanish unifloral honeys by solid phase microextraction and gas chromatography-mass spectrometry,
J. Sep. Sci., 2005, 28, 9-10, 1093-1100, https://doi.org/10.1002/jssc.200500018
. [all data]
Jirovetz, Buchbauer, et al., 2005
Jirovetz, L.; Buchbauer, G.; Stoyanova, A.; Balinova, A.; Guangjiun, Z.; Xihan, M.,
Solid phase microextraction/gas chromatographic and olfactory analysis of the scent and fixative properties of the essential oil of Rosa damascena L. from China,
Flavour Fragr. J., 2005, 20, 1, 7-12, https://doi.org/10.1002/ffj.1375
. [all data]
Lee, Umano, et al., 2005
Lee, S.-J.; Umano, K.; Shibamoto, T.; Lee, K.-G.,
Identification of volatile components in basil (Ocimum basilicum L.) and thyme leaves (Thymus vulgaris L.) and their antioxidant properties,
Food Chem., 2005, 91, 1, 131-137, https://doi.org/10.1016/j.foodchem.2004.05.056
. [all data]
Njoroge, Koaze, et al., 2005
Njoroge, S.M.; Koaze, H.; Karanja, P.N.; Sawamura, M.,
Essential oil constituents of three varieties of Kenyan sweet oranges (Citrus sinensis),
Flavour Fragr. J., 2005, 20, 1, 80-85, https://doi.org/10.1002/ffj.1377
. [all data]
Choi, 2004
Choi, H.-S.,
Volatile constituents of satsuma mandarins growing in Korea,
Flavour Fragr. J., 2004, 19, 5, 406-412, https://doi.org/10.1002/ffj.1283
. [all data]
Choi, 2004, 2
Choi, H.-S.,
Aroma evaluation of an aquatic herb, changpo (Acorus calamus Var. angustatus Bess), by AEDA and SPME,
J. Agric. Food Chem., 2004, 52, 26, 8099-8104, https://doi.org/10.1021/jf040239p
. [all data]
Soria, Gonzalez, et al., 2004
Soria, A.C.; Gonzalez, M.; de Lorenzo, C.; Martinez-Castro, I.; Sanza, J.,
Characterization of artisanal honeys from Madrid (Central Spain) on the basis of their melissopalynological, physicochemical and volatile composition data,
Food Chem., 2004, 85, 1, 121-130, https://doi.org/10.1016/j.foodchem.2003.06.012
. [all data]
Soria, Martinez-Castro, et al., 2003
Soria, A.C.; Martinez-Castro, I.; Sanz, J.,
Analysis of volatile composition of honey by solid phase microextraction and gas chromatographymass spectrometry,
J. Sep. Sci., 2003, 26, 9-10, 793-801, https://doi.org/10.1002/jssc.200301368
. [all data]
Tu, Onishi, et al., 2003
Tu, N.T.M.; Onishi, Y.; Son, U.S.; Ogawa, E.; Ukeda, H.; Sawamura, M.,
Characteristic odour components of Citrus inflata Hort. Ex Tanaka (Mochiyu) cold-pressed peel oil,
Flavour Fragr. J., 2003, 18, 5, 454-459, https://doi.org/10.1002/ffj.1252
. [all data]
Ito, Sugimoto, et al., 2002
Ito, Y.; Sugimoto, A.; Kakuda, T.; Kubota, K.,
Identification of potent odorants in Chinese jasmine green tea scented with flowers of Jasminum sambac,
J. Agric. Food Chem., 2002, 50, 17, 4878-4884, https://doi.org/10.1021/jf020282h
. [all data]
Tu, Onishi, et al., 2002
Tu, N.T.M.; Onishi, Y.; Choi, H.-S.; Kondo, Y.; Bassore, S.M.; Ukeda, H.; Sawamura, M.,
Characteristic odor components of Citrus sphaerocarpa Tanaka (Kabosu) cold-pressed peel oil,
J. Agric. Food Chem., 2002, 50, 10, 2908-2913, https://doi.org/10.1021/jf011578a
. [all data]
Tu, Thanh, et al., 2002
Tu, N.T.M.; Thanh, L.X.; Une, A.; Ukeda, H.; Sawamura, M.,
Volatile constituents of Vietnamese pummelo, orange, tangerine and lime peel oils,
Flavour Fragr. J., 2002, 17, 3, 169-174, https://doi.org/10.1002/ffj.1076
. [all data]
Kato and Shibamoto, 2001
Kato, M.; Shibamoto, T.,
Variation of major volatile constituents in various green teas from Southeast Asia,
J. Agric. Food Chem., 2001, 49, 3, 1394-1396, https://doi.org/10.1021/jf001321x
. [all data]
Chagonda, Makanda, et al., 2000
Chagonda, L.S.; Makanda, C.; Chalchat, J.-C.,
The essential oils of wild and cultivated Cymbopogon validus (Stapf) Stapf ex Burtt Davy and Elionurus muticus (Spreng.) Kunth from Zimbabwe,
Flavour Fragr. J., 2000, 15, 2, 100-104, https://doi.org/10.1002/(SICI)1099-1026(200003/04)15:2<100::AID-FFJ874>3.0.CO;2-Y
. [all data]
Morales, Duque, et al., 2000
Morales, A.L.; Duque, C.; Bautista, E.,
Identification of free and glycosidically bound volatiles and glycosides by capillary GC and capillary GC-MS in Lulo del Chocó (Solanum topiro),
J. Hi. Res. Chromatogr., 2000, 23, 5, 379-385, https://doi.org/10.1002/(SICI)1521-4168(20000501)23:5<379::AID-JHRC379>3.0.CO;2-B
. [all data]
Parada, Duque, et al., 2000
Parada, F.; Duque, C.; Fujimoto, Y.,
Free and bound volatile composition and characterization of some glucoconjugates as aroma precursors in Melón de olor fruit pulp (Sicana odorifera),
J. Agric. Food Chem., 2000, 48, 12, 6200-6204, https://doi.org/10.1021/jf0007232
. [all data]
Umano, Nakahara, et al., 1999
Umano, K.; Nakahara, K.; Shoji, A.; Shibamoto, T.,
Aroma chemicals isolated and identified from leaves of aloe arborescens Mill. Var. natalensis Berger,
J. Agric. Food Chem., 1999, 47, 9, 3702-3705, https://doi.org/10.1021/jf990116i
. [all data]
Shuichi, Masazumi, et al., 1996
Shuichi, H.; Masazumi, N.; Hiromu, K.; Kiyoshi, F.,
Comparison of volatile compounds berween the crude drugs, Onji-tsutsu and Onji-niki,
Nippon nogei kagaku kaishi, 1996, 70, 2, 151-160. [all data]
Kawakami, Kobayashi, et al., 1993
Kawakami, M.; Kobayashi, A.; Kator, K.,
Volatile constituents of Rooibos tea (Aspalathus linearis) as affected by extraction process,
J. Agric. Food Chem., 1993, 41, 4, 633-636, https://doi.org/10.1021/jf00028a023
. [all data]
Kawakami and Kobayashi, 1991
Kawakami, M.; Kobayashi, A.,
Volatitle constituents of greem mate and roasted mate,
J. Agric. Food Chem., 1991, 39, 7, 1275-1279, https://doi.org/10.1021/jf00007a016
. [all data]
Takeoka, Buttery, et al., 1991
Takeoka, G.R.; Buttery, R.G.; Teranishi, R.; Flath, R.A.; Güntert, M.,
Identification of additional pineapple volatiles,
J. Agric. Food Chem., 1991, 39, 10, 1848-1851, https://doi.org/10.1021/jf00010a032
. [all data]
Mihara, Tateba, et al., 1988
Mihara, S.; Tateba, H.; Nishimura, O.; Machii, Y.; Kishino, K.,
The volatile components of Chinese quince (Pseudocydonia sinensis Schneid)
in Flavors and Fragrances: A World Perspective. Proceedings of the 10th International Congress of Essential Oils, Fragrances and Flavors, Lawrence,B.M.; Mookherjee,B.D.; Willis,B.J., ed(s)., Elsevier, New York, 1988, 537-550. [all data]
Takeoka, Flath, et al., 1988
Takeoka, G.R.; Flath, R.A.; Güntert, M.; Jennings, W.,
Nectarine volatiles: vacuum steam distillation versus headspace sampling,
J. Agric. Food Chem., 1988, 36, 3, 553-560, https://doi.org/10.1021/jf00081a037
. [all data]
Mihara, Tateba, et al., 1987
Mihara, S.; Tateba, H.; Nishimura, O.; Machii, Y.; Kishino, K.,
Volatile components of Chinese quince (Pseudocydonia sinensis Schneid),
J. Agric. Food Chem., 1987, 35, 4, 532-537, https://doi.org/10.1021/jf00076a023
. [all data]
Buttery, Xu, et al., 1985
Buttery, R.G.; Xu, C.; Ling, L.C.,
Volatile components of wheat leaves (and stems): Possible insect attractants,
J. Agric. Food Chem., 1985, 33, 1, 115-117, https://doi.org/10.1021/jf00061a033
. [all data]
Engel and Tressl, 1983
Engel, K.-H.; Tressl, R.,
Formation of aroma components from nonvolatile precursors in passion fruit,
J. Agric. Food Chem., 1983, 31, 5, 998-1002, https://doi.org/10.1021/jf00119a019
. [all data]
Buttery, Parker, et al., 1981
Buttery, R.G.; Parker, F.D.; Teranishi, R.; Mon, T.R.; Ling, L.C.,
Volatile components of alfalfa leaf-cutter bee cells,
J. Agric. Food Chem., 1981, 29, 5, 955-958, https://doi.org/10.1021/jf00107a017
. [all data]
Soria, Martinez-Castro, et al., 2008
Soria, A.C.; Martinez-Castro, I.; Sanz, J.,
Some aspects of dynamic headspace analysis of volatile components in honey,
Foog Res. International, 2008, 41, 8, 838-848, https://doi.org/10.1016/j.foodres.2008.07.010
. [all data]
Loskos, Hernandez-Orte, et al., 2007
Loskos, N.; Hernandez-Orte, P.; Cacho, J.; Ferreira, V.,
Release and formation of varietal aroma compounds during alcoholic fermentation from nonfloral grape odorless flavor precursors fractions,
J. Agric. Food Chem., 2007, 55, 16, 6674-6684, https://doi.org/10.1021/jf0702343
. [all data]
Narain, Galvao, et al., 2007
Narain, N.; Galvao, M. deS.; Ferreira, D.DaS.; Navarro, D.M.A.F.,
Flavor biogeneration in Mangaba (Hancornia speciosa Gomes) fruit,
BioEng. Campinas, 2007, 1, 1, 25-31. [all data]
Pontes, Marques, et al., 2007
Pontes, M.; Marques, J.C.; Camara, J.S.,
Screening of volatile composition from Portuguese multifloral honeys using headspace solid-phase microextraction-gas chromatography-quadrupole mass spectrometry,
Talanta, 2007, 74, 1, 91-103, https://doi.org/10.1016/j.talanta.2007.05.037
. [all data]
Selli, 2007
Selli, S.,
Volatile constituents of orange obtained from moro oranges (Citrus Sinensis L. Osbeck),
J. Food Quality, 2007, 30, 3, 330-341, https://doi.org/10.1111/j.1745-4557.2007.00124.x
. [all data]
Iscan, Kirimer, et al., 2006
Iscan, G.; Kirimer, N.; Kurkcuoglu, M.; Arabaci, T.; Kupeli, E.; Baser, K.H.C.,
Biological Activity and Composition of the Essential Oils of Achillea schischkinii Sosn. and Achillea aleppica DC. subsp. aleppica,
J. Agric. Food Chem., 2006, 54, 1, 170-173, https://doi.org/10.1021/jf051644z
. [all data]
Tabanca, Demirci, et al., 2006
Tabanca, N.; Demirci, B.; Can Baser, K.H.; Aytac, Z.; Ekici, M.; Khan, S.I.; Jacob, M.R.; Wedge, D.E.,
Chemical Composition and Antifungal Activity of Salvia macrochlamys and Salvia recognita Essential Oils,
J. Agric. Food Chem., 2006, 54, 18, 6593-6597, https://doi.org/10.1021/jf0608773
. [all data]
Editorial paper, 2005
Editorial paper,
Solid Phase Microextraction (SPME) Application Guide,
The Reporter Europe (Supelco), 2005, 16, 5, 12-12. [all data]
Kosar, Özek, et al., 2005
Kosar, M.; Özek, T.; Göger, F.; Kürkcüoglu, M.; Hüsnü Can Baser, K.,
Comparison of Microwave-Assisted Hydrodistillation and Hydrodistillation Methods for the Analysis of Volatile Secondary Metabolites,
Pharm. Biol., 2005, 43, 6, 491-495, https://doi.org/10.1080/13880200500220136
. [all data]
Viljoen, Subramoney, et al., 2005
Viljoen, A.M.; Subramoney, S.; van Vuuren, S.F.; Baser, K.H.C.; Demirci, B.,
The composition, geographical variation and antimicrobial activity of Lippia javanica (Verbenaceae) leaf essential oils,
J. Ethnopharmacol., 2005, 96, 1-2, 271-277, https://doi.org/10.1016/j.jep.2004.09.017
. [all data]
Demirci, Paper, et al., 2004
Demirci, F.; Paper, D.H.; Demirci, F.; Hüsnü Can Baser, K.; Franz, G.,
Essential oil of Betula pendula Roth. buds,
eCAM, 2004, 1, 3, 301-303. [all data]
Kivcak, Akay, et al., 2004
Kivcak, B.; Akay, S.; Demirci, B.; Baser, K.H.C.,
Chemical composition of essential oils from leaves and twigs of Pistacia lentiscus, Pistacia lentiscus var. chia, and Pistacia terebinthus from Turkey,
Pharm. Biol, 2004, 42, 4-5, 360-366, https://doi.org/10.1080/13880200490519677
. [all data]
Baser, Demirci, et al., 2003
Baser, K.H.C.; Demirci, B.; Dekebo, A.; Dagne, E.,
Essential oils of some Boswellia spp., myrrh and opopanax,
Flavour Fragr. J., 2003, 18, 2, 153-156, https://doi.org/10.1002/ffj.1166
. [all data]
Demirci, Baser, et al., 2003
Demirci, B.; Baser, K.H.C.; Yildiz, B.; Bahcecioglu, Z.,
Composition of the essential oils of six endemic Salvia spp. from Turkey,
Flavour Fragr. J., 2003, 18, 2, 116-121, https://doi.org/10.1002/ffj.1173
. [all data]
Piasenzotto, Gracco, et al., 2003
Piasenzotto, L.; Gracco, L.; Conte, L.,
Solid phase microextraction (SPME) applied to honey quality control,
J. Sci. Food Agric., 2003, 83, 10, 1037-1044, https://doi.org/10.1002/jsfa.1502
. [all data]
Tasdemir, Demirci, et al., 2003
Tasdemir, D.; Demirci, B.; Demirci, F.; Dönmez, A.A.; Baser, K.H.C.; Rüedi, P.,
Analysis of the Volatile Components of Five Turkish Rhododendron Species by Headspace Solid-Phase Microextraction and GC-MS (HS-SPME-GC-MS),
Z. Naturforsch., 2003, 58c, 797-803. [all data]
Viljoen, van Vuuren, et al., 2003
Viljoen, A.; van Vuuren, S.; Ernst, E.; Klepser, M.; Demirci, B.; Baser, H.; van Wyk, B.-E.,
Osmitopsis asteriscoides (Asteraceae)-the antimicrobial activity and essential oil composition of a Cape-Dutch remedy,
J. Ethnopharmacol., 2003, 88, 2-3, 137-143, https://doi.org/10.1016/S0378-8741(03)00191-0
. [all data]
Baser, Demirci, et al., 2002
Baser, K.H.C.; Demirci, B.; Kirimer, N.; Satil, F.; Tumen, G.,
The essential oils of Thymus migricus and T. fedtschenkoi var. handelii from Turkey,
Flavour Fragr. J., 2002, 17, 1, 41-45, https://doi.org/10.1002/ffj.1036
. [all data]
Baser, Demirci, et al., 2001
Baser, K.H.C.; Demirci, B.; Tabanca, N.; Özek, T.; Gören, N.,
Composition of the essential oils of Tanacetum armenum (DC.) Schultz Bip., T. balsamita L., T. chiliophyllum (Fisch. Mey.) Schultz Bip. var. chiliophyllum and T. haradjani (Rech. fil.) Grierson and the enantiomeric distribution of camphor and carvone,
Flavour Fragr. J., 2001, 16, 3, 195-200, https://doi.org/10.1002/ffj.977
. [all data]
Kaya, Demirci, et al., 2001
Kaya, A.; Demirci, B.; Baser, K.H.C.,
The composition of the essential oil of Stachys iberica subsp. stenostachya growing in Turkey,
Chem. Nat. Compd. (Engl. Transl.), 2001, 37, 4, 326-328, https://doi.org/10.1023/A:1013762200024
. [all data]
Saglam, Gozler, et al., 2001
Saglam, H.; Gozler, T.; Kivcak, B.; Demirci, B.; Baser, K.H.C.,
Volatile compounds from Haplophyllum myrtifolium,
Chem. Nat. Compd. (Engl. Transl.), 2001, 37, 5, 442-444, https://doi.org/10.1023/A:1014467225815
. [all data]
Schneider, Razungles, et al., 2001
Schneider, R.; Razungles, A.; Augier, C.; Baumes, R.,
Monoterpenic and norisoprenoidic glycoconjugates of Vitis vinifera L. cv. Melon B. as precursors of odorants in Muscadet wines,
J. Chromatogr. A, 2001, 936, 1-2, 145-157, https://doi.org/10.1016/S0021-9673(01)01150-5
. [all data]
Tabanca, Kirimer, et al., 2001
Tabanca, N.; Kirimer, N.; Demirci, B.; Demirci, F.; Can Baser, K.H.,
Composition and antimicrobial activity of the essential oils of Micromeria cristata subsp. phrygia and the enantiomeric distribution of borneol,
J. Agric. Food Chem., 2001, 49, 9, 4300-4303, https://doi.org/10.1021/jf0105034
. [all data]
Kamariah, Lim, et al., 1999
Kamariah, A.S.; Lim, L.B.L.; Baser, K.H.C.; Ozek, T.; Demirci, B.,
Composition of the essential oil of Plumeria obtusa L.,
Flavour Fragr. J., 1999, 14, 4, 237-240, https://doi.org/10.1002/(SICI)1099-1026(199907/08)14:4<237::AID-FFJ817>3.0.CO;2-Y
. [all data]
Baser, Kürkcüoglu, et al., 1998
Baser, K.H.C.; Kürkcüoglu, M.; Aytac, Z.,
Composition of the essential oil of Salvia euphratica Montbret ex Bentham var. euphratica from Turkey,
Flavour Fragr. J., 1998, 13, 1, 63-64, https://doi.org/10.1002/(SICI)1099-1026(199801/02)13:1<63::AID-FFJ694>3.0.CO;2-Z
. [all data]
Vernin, Lageot, et al., 1998
Vernin, G.; Lageot, C.; Parkanyi, C.,
GC-MS(EI, PCI, NCI, SIM, ITMS) Data Bank Analysis of Flavors and Fragrances. Kovats indices
in Instrumental Methods on Food and Beverage Analysis, D. Wetzel, G. Charalambous, ed(s)., Elsevier Sci. B.V., Amsterdam, 1998, 245-301. [all data]
López-Tamames, Carro-Mariño, et al., 1997
López-Tamames, E.; Carro-Mariño, N.; Gunata, Y.Z.; Sapis, C.; Baumes, R.; Bayonove, C.,
Potential aroma in several varieties of Spanish grapes,
J. Agric. Food Chem., 1997, 45, 5, 1729-1735, https://doi.org/10.1021/jf960572w
. [all data]
Carro Marino, López Tamames, et al., 1995
Carro Marino, N.; López Tamames, E.; García Jares, C.M.,
Contribution to the study of the aromatic potential of three muscat Vitis vinifera varieties: identification of new compounds,
Food Sci. Technol. Int., 1995, 1, 2-3, 105-116, https://doi.org/10.1177/108201329500100206
. [all data]
MacLeod and Pieris, 1981
MacLeod, A.J.; Pieris, N.M.,
Volatile flavor components of beli fruit (Aegle marmelos) and a processed product,
J. Agric. Food Chem., 1981, 29, 6, 1262-1264, https://doi.org/10.1021/jf00108a040
. [all data]