trans-1,2-Dibromocyclooctane
- Formula: C8H14Br2
- Molecular weight: 270.005
- IUPAC Standard InChIKey: BOESCCYXMLOHNO-YUMQZZPRSA-N
- CAS Registry Number: 34969-65-8
- Chemical structure:
View 3d structure (requires JavaScript / HTML 5) - Stereoisomers:

Phase change data

Data compiled by: Hussein Y. Afeefy, Joel F. Liebman, and Stephen E. Stein
Quantity | Value | Units | Method | Reference | Comment |
---|---|---|---|---|---|
ΔvapH° | 54.543 | kJ/mol | V | Lister, 1941 |

References

Lister, 1941
Lister, M.W.,
Heats of organic reactions. X. Heats of bromination of cyclic olefins,
J. Am. Chem. Soc., 1941, 63, 143-149. [all data]