3,5-Bis(trifluoromethyl)phenol
- Formula: C8H4F6O
- Molecular weight: 230.1072
- IUPAC Standard InChIKey: ODSXJQYJADZFJX-UHFFFAOYSA-N
- CAS Registry Number: 349-58-6
- Chemical structure:
View 3d structure (requires JavaScript / HTML 5) - Other names: 3,5-di(Trifluoromethyl)phenol; Phenol, 3,5-bis(trifluoromethyl)-; 3,5-Xylenol, aplha,aplha,aplha,aplha',aplha',aplha'-hexafluoro-; α,α,α,α',α',α'-hexafluoro-3,5-xylenol

Reaction thermochemistry data

Data compiled by: John E. Bartmess
Individual Reactions
C8H3F6O- + =
By formula: C8H3F6O- + H+ = C8H4F6O
Quantity | Value | Units | Method | Reference | Comment |
---|---|---|---|---|---|
ΔrH° | 1379. ± 8.8 | kJ/mol | G+TS | Taft and Topsom, 1987 | gas phase |
Quantity | Value | Units | Method | Reference | Comment |
ΔrG° | 1351. ± 8.4 | kJ/mol | IMRE | Taft and Topsom, 1987 | gas phase |

Gas phase ion energetics data

Data compiled by: John E. Bartmess
De-protonation reactions
C8H3F6O- + =
By formula: C8H3F6O- + H+ = C8H4F6O
Quantity | Value | Units | Method | Reference | Comment |
---|---|---|---|---|---|
ΔrH° | 1379. ± 8.8 | kJ/mol | G+TS | Taft and Topsom, 1987 | gas phase |
Quantity | Value | Units | Method | Reference | Comment |
ΔrG° | 1351. ± 8.4 | kJ/mol | IMRE | Taft and Topsom, 1987 | gas phase |

References

Taft and Topsom, 1987
Taft, R.W.; Topsom, R.D.,
The Nature and Analysis of Substituent Effects,
Prog. Phys. Org. Chem., 1987, 16, 1. [all data]