tert-pentyl propionate

Phase change data

Data compiled by: William E. Acree, Jr., James S. Chickos

Quantity Value Units Method Reference Comment
Δvap45.3 ± 0.1kJ/molGSVerevkin and Emel'yanenko, 2008Based on data from 274. - 310. K.
Δvap45.7kJ/molCGCVerevkin and Heintz, 1999Based on data from 333. - 378. K.

References

Verevkin and Emel'yanenko, 2008
Verevkin, Sergey P.; Emel'yanenko, Vladimir N., Transpiration method: Vapor pressures and enthalpies of vaporization of some low-boiling esters, Fluid Phase Equilibria, 2008, 266, 1-2, 64-75, https://doi.org/10.1016/j.fluid.2008.02.001 . [all data]

Verevkin and Heintz, 1999
Verevkin, Sergey P.; Heintz, Andreas, Determination of Vaporization Enthalpies of the Branched Esters from Correlation Gas Chromatography and Transpiration Methods, J. Chem. Eng. Data, 1999, 44, 6, 1240-1244, https://doi.org/10.1021/je990122a . [all data]