C10H12N2
- Formula: C10H12N2
- Molecular weight: 160.2157
- CAS Registry Number: 34906-70-2

Reaction thermochemistry data

Data compiled by: John E. Bartmess
Individual Reactions
C10H11N2- + = C10H12N2
By formula: C10H11N2- + H+ = C10H12N2
Quantity | Value | Units | Method | Reference | Comment |
---|---|---|---|---|---|
ΔrH° | 1478. ± 10. | kJ/mol | G+TS | Taft, 1987 | gas phase; value altered from reference due to change in acidity scale |
Quantity | Value | Units | Method | Reference | Comment |
ΔrG° | 1450. ± 8.4 | kJ/mol | IMRE | Taft, 1987 | gas phase; value altered from reference due to change in acidity scale |

Gas phase ion energetics data

Data compiled by: John E. Bartmess

De-protonation reactions

C10H11N2- + Hydrogen cation = C10H12N2

By formula: C10H11N2- + H+ = C10H12N2

Quantity Value Units Method Reference Comment
Δr353.2 ± 2.5kcal/molG+TSTaft, 1987gas phase; value altered from reference due to change in acidity scale
Quantity Value Units Method Reference Comment
Δr346.6 ± 2.0kcal/molIMRETaft, 1987gas phase; value altered from reference due to change in acidity scale

References

Taft, 1987
Taft, R.W.,
The Nature and Analysis of Substitutent Electronic Effects,
Personal communication. See also Prog. Phys. Org. Chem., 1987, 16, 1. [all data]