D-Methionine
- Formula: C5H11NO2S
- Molecular weight: 149.211
- IUPAC Standard InChIKey: FFEARJCKVFRZRR-BYPYZUCNSA-N
- CAS Registry Number: 348-67-4
- Chemical structure:
View 3d structure (requires JavaScript / HTML 5) - Stereoisomers:
- Other names: Methionine, D-; R-Methionine; D-Metionien; d-2-Amino-4-(methylthio)butyric acid; Methionine d-form; D-(l)-methionine

Phase change data

Data compiled by: William E. Acree, Jr., James S. Chickos
Enthalpy of sublimation
ΔsubH (kJ/mol) | Temperature (K) | Method | Reference | Comment |
---|---|---|---|---|
125.1 ± 0.8 | 455. | ME | Svec and Clyde, 1965 | See also Clyde and Svec, 1964. |

References

Svec and Clyde, 1965
Svec, H.J.; Clyde, D.D.,
Vapor Pressures of Some α-Amino Acids.,
J. Chem. Eng. Data, 1965, 10, 2, 151-152, https://doi.org/10.1021/je60025a024
. [all data]
Clyde and Svec, 1964
Clyde, D.D.; Svec, H.,
, U. S. Atomic Energy Comm. IS-790, 1964, 1. [all data]