2,2-Dichloroethyl methyl ether
- Formula: C3H6Cl2O
- Molecular weight: 128.985
- IUPAC Standard InChIKey: QUCLHUUEEKVBGT-UHFFFAOYSA-N
- CAS Registry Number: 34862-07-2
- Chemical structure:
View 3d structure (requires JavaScript / HTML 5) - Other names: Ethane, 1,1-dichloro-2-methoxy-; Methyl 2,2-dichloroethyl ether; 1,1-dichloro-2-methoxyethane

Van Den Dool and Kratz RI, non-polar column, custom temperature program

Column type | Active phase | I | Reference | Comment |
---|---|---|---|---|
Capillary | VF-5MS | 784.9 | Tret'yakov, 2007 | 30. m/0.25 mm/0.25 μm, He; Program: Multi-step temperature program; T(initial)=60C; T(final)=270C |

Normal alkane RI, polar column, custom temperature program

Column type | Active phase | I | Reference | Comment |
---|---|---|---|---|
Capillary | Superox 0.6; Carbowax 20M | 1158. | Waggott and Davies, 1984 | Hydrogen; Column length: 50. m; Column diameter: 0.32 mm; Program: not specified |
Capillary | Carbowax 400, Carbowax 20M, Carbowax 1540, Carbowax 4000, Superox 06, PEG 20M, etc. | 1158. | Waggott and Davies, 1984 | Hydrogen; Column length: 50. m; Column diameter: 0.32 mm; Program: not specified |

References

Tret'yakov, 2007
Tret'yakov, K.V.,
Retention Data. NIST Mass Spectrometry Data Center., NIST Mass Spectrometry Data Center, 2007. [all data]
Waggott and Davies, 1984
Waggott, A.; Davies, I.W.,
Identification of organic pollutants using linear temperature programmed retention indices (LTPRIs) - Part II, 1984, retrieved from http://dwi.defra.gov.uk/research/completed-research/reports/dwi0383.pdf. [all data]