Benzenamine, 2-fluoro-
- Formula: C6H6FN
- Molecular weight: 111.1169
- IUPAC Standard InChIKey: FTZQXOJYPFINKJ-UHFFFAOYSA-N
- CAS Registry Number: 348-54-9
- Chemical structure:
View 3d structure (requires JavaScript / HTML 5) - Other names: Aniline, o-fluoro-; o-Fluoroaniline; 2-Fluoroaniline; 2-Fluorobenzenamine; 1-Amino-2-fluorobenzene; Aniline, 2-fluoro-; UN 2941; Benzeneamine, 2-fluoro

Condensed phase thermochemistry data

Data compiled by: Hussein Y. Afeefy, Joel F. Liebman, and Stephen E. Stein
Quantity | Value | Units | Method | Reference | Comment |
---|---|---|---|---|---|
ΔcH°liquid | -778.15 | kcal/mol | Ccb | Swarts, 1919 | Not corrected for CODATA value of ΔfH |

Phase change data

Data compiled as indicated in comments:
BS - Robert L. Brown and Stephen E. Stein
AC - William E. Acree, Jr., James S. Chickos
Quantity | Value | Units | Method | Reference | Comment |
---|---|---|---|---|---|
Tboil | 455.7 | K | N/A | Aldrich Chemical Company Inc., 1990 | BS |
Quantity | Value | Units | Method | Reference | Comment |
ΔvapH° | 12.4 ± 0.1 | kcal/mol | C | Ribeiro da Silva, Ferreira, et al., 2007 | AC |
Reduced pressure boiling point
Tboil (K) | Pressure (atm) | Reference | Comment |
---|---|---|---|
328. to 329. | 0.016 | PCR Inc., 1990 | BS |

Gas phase ion energetics data

Data compiled as indicated in comments:
LBLHLM - Sharon G. Lias, John E. Bartmess, Joel F. Liebman, John L. Holmes, Rhoda D. Levin, and W. Gary Mallard
LLK - Sharon G. Lias, Rhoda D. Levin, and Sherif A. Kafafi
Ionization energy determinations
IE (eV) | Method | Reference | Comment |
---|---|---|---|
8.50 | EI | Baldwin, Loudon, et al., 1976 | LLK |
8.18 | PE | Furin, Sultanov, et al., 1987 | Vertical value; LBLHLM |
8.18 | PE | Palmer, Moyes, et al., 1979 | Vertical value; LLK |

Van Den Dool and Kratz RI, non-polar column, temperature ramp

View large format table.

Column type Active phase I Reference Comment
CapillaryOV-1929.5Gautzsch and Zinn, 19968. K/min; Tstart: 35. C; Tend: 300. C

Normal alkane RI, non-polar column, temperature ramp

View large format table.

Column type Active phase I Reference Comment
CapillaryOV-101930.Zenkevich, 200525. m/0.20 mm/0.10 μm, N2/He, 6. K/min; Tstart: 50. C; Tend: 250. C

References

Swarts, 1919
Swarts, F.,
Etudes thermochimiques sur les combinaisons organiques fluorees,
J. Chim. Phys., 1919, 17, 3-70. [all data]
Aldrich Chemical Company Inc., 1990
Aldrich Chemical Company Inc.,
Catalog Handbook of Fine Chemicals, Aldrich Chemical Company, Inc., Milwaukee WI, 1990, 1. [all data]
Ribeiro da Silva, Ferreira, et al., 2007
Ribeiro da Silva, Manuel A.V.; Ferreira, Ana I.M.C.L.; Gomes, José R.B.,
Combined Experimental and Computational Study of the Thermochemistry of the Fluoroaniline Isomers,
J. Phys. Chem. B, 2007, 111, 8, 2052-2061, https://doi.org/10.1021/jp0672407
. [all data]
PCR Inc., 1990
PCR Inc.,
Research Chemicals Catalog 1990-1991, PCR Inc., Gainesville, FL, 1990, 1. [all data]