bromoselenobenzene
- Formula: C6H5BrSe
- Molecular weight: 235.97
- IUPAC Standard InChIKey: LCEFEIBEOBPPSJ-UHFFFAOYSA-N
- CAS Registry Number: 34837-55-3
- Chemical structure:
View 3d structure (requires JavaScript / HTML 5) - Other names: Phenylselenenyl bromide

Phase change data

Data compiled by: Robert L. Brown and Stephen E. Stein
Quantity | Value | Units | Method | Reference | Comment |
---|---|---|---|---|---|
Tfus | 333. | K | N/A | Buckingham and Donaghy, 1982 | |
Tfus | 333. | K | N/A | Buckingham and Donaghy, 1982 |
Reduced pressure boiling point
Tboil (K) | Pressure (bar) | Reference |
---|---|---|
407. | 0.047 | Buckingham and Donaghy, 1982 |
380. to 381. | 0.020 | Buckingham and Donaghy, 1982 |
407. | 0.047 | Buckingham and Donaghy, 1982 |
380. to 381. | 0.020 | Buckingham and Donaghy, 1982 |

References

Buckingham and Donaghy, 1982
Buckingham, J.; Donaghy, S.M.,
Dictionary of Organic Compounds: Fifth Edition, Chapman and Hall, New York, 1982, 1. [all data]