propane, 2,2-dimethyl-1-nitro-
- Formula: C5H11NO2
- Molecular weight: 117.1463
- CAS Registry Number: 34715-98-5

Reaction thermochemistry data

Data compiled by: John E. Bartmess
Individual Reactions
C5H10NO2- + = C5H11NO2
By formula: C5H10NO2- + H+ = C5H11NO2
Quantity | Value | Units | Method | Reference | Comment |
---|---|---|---|---|---|
ΔrH° | 355.1 ± 2.2 | kcal/mol | G+TS | Bartmess, Scott, et al., 1979 | gas phase; value altered from reference due to change in acidity scale |
Quantity | Value | Units | Method | Reference | Comment |
ΔrG° | 348.4 ± 2.0 | kcal/mol | IMRE | Bartmess, Scott, et al., 1979 | gas phase; value altered from reference due to change in acidity scale |

References

Bartmess, Scott, et al., 1979
Bartmess, J.E.; Scott, J.A.; McIver, R.T., Jr.,
The gas phase acidity scale from methanol to phenol,
J. Am. Chem. Soc., 1979, 101, 6047. [all data]