2,5-Pyrrolidinedione, 1-butyl-
- Formula: C8H13NO2
- Molecular weight: 155.1943
- IUPAC Standard InChIKey: HKAIIKVJIRPASO-UHFFFAOYSA-N
- CAS Registry Number: 3470-96-0
- Chemical structure:
View 3d structure (requires JavaScript / HTML 5) - Other names: Succinimide, N-butyl-; n-Butylsuccinimide

Phase change data

Data compiled by: Robert L. Brown and Stephen E. Stein
Reduced pressure boiling point
Tboil (K) | Pressure (bar) | Reference |
---|---|---|
410. to 412. | 0.020 | Frinton Laboratories Inc., 1986 |

References

Frinton Laboratories Inc., 1986
Frinton Laboratories Inc.,
Catalog Number 11, Frinton Laboratories Inc., Vineland, NJ, 1986, 99. [all data]