Benzeneacetic acid, α-phenyl-, methyl ester
- Formula: C15H14O2
- Molecular weight: 226.2705
- IUPAC Standard InChIKey: AORIUCNKPVHMTN-UHFFFAOYSA-N
- CAS Registry Number: 3469-00-9
- Chemical structure:
View 3d structure (requires JavaScript / HTML 5) - Other names: Acetic acid, diphenyl-, methyl ester; Diphenylacetic acid, methyl ester; Methyl diphenylacetate

Kovats' RI, non-polar column, isothermal

Column type | Active phase | Temperature (C) | I | Reference | Comment |
---|---|---|---|---|---|
Capillary | HP-5 | 200. | 1775. | Soják, Perjéssy, et al., 1998 | 8. m/0.32 mm/0.17 μm, He |

Van Den Dool and Kratz RI, non-polar column, temperature ramp

Column type | Active phase | I | Reference | Comment |
---|---|---|---|---|
Capillary | 5 % Phenyl methyl siloxane | 1740. | Zaikin, 2010 | 30. m/0.25 mm/0.25 μm, 15. K/min, 270. C @ 15. min; Tstart: 60. C |

References

Soják, Perjéssy, et al., 1998
Soják, L.; Perjéssy, A.; Kubinec, R.; Giumanini, A.G.,
CGC-FTIR characterization of mononitro and dinitro isomers from nitration mixtures of methyl arylacetates,
Chem. Pap., 1998, 52, 1, 34-40. [all data]
Zaikin, 2010
Zaikin, V.G.,
Personal communication: Retention indices measured during 2010, 2010. [all data]