2-Norbornyl acetate
- Formula: C9H14O2
- Molecular weight: 154.2063
- IUPAC Standard InChIKey: YXNICIBZSREEPY-UHFFFAOYSA-N
- CAS Registry Number: 34640-76-1
- Chemical structure:
View 3d structure (requires JavaScript / HTML 5) - Stereoisomers:
- Other names: Bicyclo[2.2.1]heptan-2-ol, acetate; Norbornyl acetate; Acetic acid, bicyclo[2.2.1]hept-2-yl ester; Bicyclo[2.2.1]hept-2-yl acetate; Norborneol acetate

Phase change data

Data compiled by: Thermodynamics Research Center, NIST Boulder Laboratories, Chris Muzny director
Quantity | Value | Units | Method | Reference | Comment |
---|---|---|---|---|---|
Tfus | 237.1 | K | N/A | Anonymous, 1955 | Uncertainty assigned by TRC = 0.6 K |

Kovats' RI, non-polar column, temperature ramp

Column type | Active phase | I | Reference | Comment |
---|---|---|---|---|
Capillary | Methyl Silicone | 1114. | Adegoke, Rao, et al., 1998 | 30. m/0.32 mm/0.25 μm, He, 60. C @ 2. min, 2. K/min, 250. C @ 5. min |
Capillary | Methyl Silicone | 1114.3 | Rao, Rajanikanth, et al., 1989 | 4. K/min, 250. C @ 15. min; Column length: 12. m; Column diameter: 0.5 mm; Tstart: 70. C |

Van Den Dool and Kratz RI, non-polar column, temperature ramp

Column type | Active phase | I | Reference | Comment |
---|---|---|---|---|
Capillary | RTX-5 | 1127. | Shellie, Mondello, et al., 2002 | 30. m/0.25 mm/0.25 μm, He, 45. C @ 6. min, 3. K/min; Tend: 250. C |
Capillary | RTX-5 | 1132. | Shellie, Mondello, et al., 2002 | 30. m/0.25 mm/0.25 μm, He, 45. C @ 6. min, 3. K/min; Tend: 250. C |

Normal alkane RI, non-polar column, custom temperature program

Column type | Active phase | I | Reference | Comment |
---|---|---|---|---|
Capillary | SE-30 | 1112. | Vinogradov, 2004 | Program: not specified |
Capillary | 5 % Phenyl methyl siloxane | 1110. | Sagrero-Nieves and Bartley, 1995 | Program: not specified |
Capillary | OV-101 | 1112. | Shibamoto, 1987 | Program: not specified |

Normal alkane RI, polar column, custom temperature program

Column type | Active phase | I | Reference | Comment |
---|---|---|---|---|
Capillary | Carbowax 20M | 1476. | Vinogradov, 2004 | Program: not specified |
Capillary | Carbowax 20M | 1476. | Shibamoto, 1987 | Program: not specified |

References

Anonymous, 1955
Anonymous, R.,
, Am. Pet. Inst. Res. Proj. 45, Tech. Rep. 14, No. 1, Ohio State Univ., 1955. [all data]