1,1,1,3,3,3-Hexafluoro-2-isocyanato-N-[2,2,2-trifluoro-1-(trifluoromethyl)ethylidene]-2-propanamine

Phase change data

Data compiled by: William E. Acree, Jr., James S. Chickos

Enthalpy of vaporization

ΔvapH (kcal/mol) Temperature (K) Method Reference
9.39375.ISwindell, Babb, et al., 1972

References

Swindell, Babb, et al., 1972
Swindell, Richard F.; Babb, Daniel P.; Ouellette, Thomas J.; Shreeve, Jean'ne M., Hexafluoropropylideniminolithium reactions with halides, Inorg. Chem., 1972, 11, 2, 242-245, https://doi.org/10.1021/ic50108a007 . [all data]