4,4'-Difluorobenzophenone
- Formula: C13H8F2O
- Molecular weight: 218.1988
- IUPAC Standard InChIKey: LSQARZALBDFYQZ-UHFFFAOYSA-N
- CAS Registry Number: 345-92-6
- Chemical structure:
View 3d structure (requires JavaScript / HTML 5) - Other names: Methanone, bis(4-fluorophenyl)-; Benzophenone, 4,4'-difluoro-; Bis(4-fluorophenyl) ketone; Bis(4-fluorophenyl)methanone; Bis(p-fluorophenyl) ketone; Di-p-fluorophenyl ketone; p,p'-Difluorobenzophenone; NSC 51800

Gas phase ion energetics data

Data compiled by: John E. Bartmess
Electron affinity determinations
EA (eV) | Method | Reference | Comment |
---|---|---|---|
0.776 ± 0.048 | IMRE | Fukuda and McIver, 1985 | ΔGea(355 K) = -19.1 kcal/mol; ΔSea = 3.5, est. from data in Kebarle and Chowdhury, 1987 |

References

Fukuda and McIver, 1985
Fukuda, E.K.; McIver, R.T., Jr.,
Relative electron affinities of substituted benzophenones, nitrobenzenes, and quinones. [Anchored to EA(SO2) from 74CEL/BEN],
J. Am. Chem. Soc., 1985, 107, 2291. [all data]
Kebarle and Chowdhury, 1987
Kebarle, P.; Chowdhury, S.,
Electron affinities and electron transfer reactions,
Chem. Rev., 1987, 87, 513. [all data]