p-Fluorobenzophenone
- Formula: C13H9FO
- Molecular weight: 200.2084
- IUPAC Standard InChIKey: OGTSHGYHILFRHD-UHFFFAOYSA-N
- CAS Registry Number: 345-83-5
- Chemical structure:
View 3d structure (requires JavaScript / HTML 5) - Other names: 4-Fluorobenzophenone; Methanone, (4-fluorophenyl)phenyl-; Benzophenone, 4-fluoro-

Gas phase ion energetics data

Data compiled by: John E. Bartmess
Electron affinity determinations
EA (eV) | Method | Reference | Comment |
---|---|---|---|
0.62 ± 0.10 | IMRE | Grimsrud, Caldwell, et al., 1985 | ΔGea(423 K) = -15.8 kcal/mol; ΔSea (estimated) = +3.5 eu. |
0.729 ± 0.087 | IMRE | Huh, Kang, et al., 1999 | ΔG(EA) 343K; anchored to ΔG value. Including anchor ΔS, EA is ca. 0.4 kcal/mol more bound. |
0.724 ± 0.048 | IMRE | Fukuda and McIver, 1985 | ΔGea(355 K) = -17.9 kcal/mol; ΔSea = 3.5, est. from data in Kebarle and Chowdhury, 1987 |

References

Grimsrud, Caldwell, et al., 1985
Grimsrud, E.; Caldwell, G.; Kebarle, P.,
Electron affinities from electron transfer equilibria: A- + B = A + B-,
J. Am. Chem. Soc., 1985, 107, 4627. [all data]
Huh, Kang, et al., 1999
Huh, C.; Kang, C.H.; Lee, H.W.; Nakamura, H.; Mishima, M.; Tsuno, Y.; Yamataka, H.,
Thermodynamic stabilities and resonance demand of aromatic radical anions in the gas phase,
Bull. Chem. Soc. Japan, 1999, 72, 5, 1083-1091, https://doi.org/10.1246/bcsj.72.1083
. [all data]
Fukuda and McIver, 1985
Fukuda, E.K.; McIver, R.T., Jr.,
Relative electron affinities of substituted benzophenones, nitrobenzenes, and quinones. [Anchored to EA(SO2) from 74CEL/BEN],
J. Am. Chem. Soc., 1985, 107, 2291. [all data]
Kebarle and Chowdhury, 1987
Kebarle, P.; Chowdhury, S.,
Electron affinities and electron transfer reactions,
Chem. Rev., 1987, 87, 513. [all data]
Lang (editor), 1968
Lang (editor), L.,
Absorption Spectra in the Ultraviolet and Visible Region, 1968, 10, 87. [all data]