d-Mannose
- Formula: C6H12O6
- Molecular weight: 180.1559
- IUPAC Standard InChIKey: GZCGUPFRVQAUEE-KVTDHHQDSA-N
- CAS Registry Number: 3458-28-4
- Chemical structure:
View 3d structure (requires JavaScript / HTML 5) - Stereoisomers:
- Other names: Mannose, d-; Carubinose; d(+)-Mannose; Mannose; Seminose
- Comments:
- Although only a single structure is shown, this species may exist in several forms including a linear molecule and a six membered ring.

Condensed phase thermochemistry data

Data compiled as indicated in comments:
ALS - Hussein Y. Afeefy, Joel F. Liebman, and Stephen E. Stein
DH - Eugene S. Domalski and Elizabeth D. Hearing
Quantity | Value | Units | Method | Reference | Comment |
---|---|---|---|---|---|
ΔfH°solid | -1263.4 ± 1.2 | kJ/mol | Ccb | Wu, Finch, et al., 1987 | ALS |
Quantity | Value | Units | Method | Reference | Comment |
ΔcH°solid | -2812.67 ± 0.93 | kJ/mol | Ccb | Wu, Finch, et al., 1987 | Corresponding ΔfHºsolid = -1263.37 kJ/mol (simple calculation by NIST; no Washburn corrections); ALS |
ΔcH°solid | -2813.0 ± 3.4 | kJ/mol | Ccb | Stroh and Fincke, 1963 | Corresponding ΔfHºsolid = -1263.0 kJ/mol (simple calculation by NIST; no Washburn corrections); ALS |
Constant pressure heat capacity of solid
Cp,solid (J/mol*K) | Temperature (K) | Reference | Comment |
---|---|---|---|
216. | 303. | Kawaizumi, Kushida, et al., 1981 | T = 300 to 315 K.; DH |
214.2 | 300. | Kawaizumi, Nishio, et al., 1981 | T = 270 to 325 K. Cp given as 1.19 J/g*K.; DH |

Reaction thermochemistry data

Data compiled by: Robert C. Dunbar
Individual Reactions
By formula: Na+ + C6H12O6 = (Na+ • C6H12O6)
Quantity | Value | Units | Method | Reference | Comment |
---|---|---|---|---|---|
ΔrH° | 179. | kJ/mol | CIDC | Cerda and Wesdemiotis, 1999 |
Free energy of reaction
ΔrG° (kJ/mol) | T (K) | Method | Reference |
---|---|---|---|
0.0 | 298. | CIDC | Cerda and Wesdemiotis, 1999 |

Ion clustering data

Data compiled by: Robert C. Dunbar
Clustering reactions
By formula: Na+ + C6H12O6 = (Na+ • C6H12O6)
Quantity | Value | Units | Method | Reference | Comment |
---|---|---|---|---|---|
ΔrH° | 179. | kJ/mol | CIDC | Cerda and Wesdemiotis, 1999 |
Free energy of reaction
ΔrG° (kJ/mol) | T (K) | Method | Reference |
---|---|---|---|
0.0 | 298. | CIDC | Cerda and Wesdemiotis, 1999 |

References

Wu, Finch, et al., 1987
Wu, D.; Finch, A.; Gardner, P.J.,
Standard energy of combustion and enthalpy of formation of α-D-mannose,
Wuhan Daxue Zuebao, Ziran Kexueban, 1987, 59-63. [all data]
Stroh and Fincke, 1963
Stroh, H.H.; Fincke, C.R.,
Beobachtung ciner unterschidlichen hydrierbarkeit von n-substituiertten aziridin-derivaten,
Z. Chem., 1963, 3, 265-266. [all data]
Kawaizumi, Kushida, et al., 1981
Kawaizumi, F.; Kushida, S.; Miyahara, Y.,
Determination of the specific heat capacities of aqueous solutions of pentose,
Bull. Chem. Soc. Japan, 1981, 54(8), 2282-2285. [all data]
Kawaizumi, Nishio, et al., 1981
Kawaizumi, F.; Nishio, N.; Nomura, H.; Miyahara, Y.,
Heat-capacity measurements of aqueous solutions of mono-, di-, and tri-saccharides using an isoperibol twin calorimeter,
J. Chem. Thermodynam., 1981, 13, 89-98. [all data]
Cerda and Wesdemiotis, 1999
Cerda, B.A.; Wesdemiotis, C.,
Thermochemistry and Structures of Na+ Coordinated Mono- and Disaccharide Stereoisomers,
Int. J. Mass Spectrom., 1999, 189, 2-3, 189, https://doi.org/10.1016/S1387-3806(99)00085-8
. [all data]