1,4-Butanediol, dinitrate
- Formula: C4H8N2O6
- Molecular weight: 180.1161
- IUPAC Standard InChIKey: QELUAJBXJAWSRC-UHFFFAOYSA-N
- CAS Registry Number: 3457-91-8
- Chemical structure:
View 3d structure (requires JavaScript / HTML 5) - Other names: Tetramethylene dinitrate; Tetramethylene nitrate; 1,4-Butylene glycol dinitrate

Condensed phase thermochemistry data

Data compiled by: Hussein Y. Afeefy, Joel F. Liebman, and Stephen E. Stein
Quantity | Value | Units | Method | Reference | Comment |
---|---|---|---|---|---|
ΔfH°liquid | -274. | kJ/mol | Ccb | Sosnova, Voskoboinikov, et al., 1962 | |
ΔfH°liquid | -331. | kJ/mol | Ccb | Handrick, 1956 | Naval Powder Factory, 1951 |
Quantity | Value | Units | Method | Reference | Comment |
ΔcH°liquid | -2387. | kJ/mol | Ccb | Handrick, 1956 | Naval Powder Factory, 1951 |

Phase change data

Data compiled as indicated in comments:
TRC - Thermodynamics Research Center, NIST Boulder Laboratories, Chris Muzny director
AC - William E. Acree, Jr., James S. Chickos
Quantity | Value | Units | Method | Reference | Comment |
---|---|---|---|---|---|
Tfus | 285. | K | N/A | Kemp, Goldhaber, et al., 1957 | Uncertainty assigned by TRC = 0.1 K; TRC |
Enthalpy of vaporization
ΔvapH (kJ/mol) | Temperature (K) | Method | Reference | Comment |
---|---|---|---|---|
57.4 ± 0.8 | 303. | A,GS | Stephenson and Malanowski, 1987 | Based on data from 293. to 313. K. See also Kemp, Goldhagen, et al., 1957.; AC |

Normal alkane RI, non-polar column, temperature ramp

Column type | Active phase | I | Reference | Comment |
---|---|---|---|---|
Capillary | DB-1 | 1213. | Schneider and Ballschniter, 1996 | 40. C @ 3. min, 3. K/min; Tend: 250. C |

References

Sosnova, Voskoboinikov, et al., 1962
Sosnova, G.S.; Voskoboinikov, M.; Brusnikina, V.M.; Lapshina, Z.Ya.; Novikov, S.S.; Apin, A.Ya.,
Comparative data on the physiocochemical properties of some liquid explosive substances,
Bull. Acad. Sci. USSR, Div. Chem. Sci., 1962, 325-326. [all data]
Handrick, 1956
Handrick, G.R.,
Report of the study of pure explosive compounds. Part IV. Calculation of heat of combustion of organic compounds from structural features and calculation of power of high explosives, Rpt. C-58247 for the Office of the Chief of Ordnance, contract DA-19-020-ORD-47 by the Arthur D. Little, Inc., Cambridge, MA, 1956, 467-573. [all data]
Kemp, Goldhaber, et al., 1957
Kemp, M.D.; Goldhaber, S.; Zihlman, F.A.,
Vapor pressures and cryoscopic data for some aliphatic dinitroxy and trinitroxy compounds,
J. Phys. Chem., 1957, 61, 240-2. [all data]
Stephenson and Malanowski, 1987
Stephenson, Richard M.; Malanowski, Stanislaw,
Handbook of the Thermodynamics of Organic Compounds, 1987, https://doi.org/10.1007/978-94-009-3173-2
. [all data]
Kemp, Goldhagen, et al., 1957
Kemp, M.D.; Goldhagen, S.; Zihlman, F.A.,
Vapor Pressures and Cryoscopic Data for Some Aliphatic Dinitroxy and Trinitroxy Compounds,
J. Phys. Chem., 1957, 61, 2, 240-242, https://doi.org/10.1021/j150548a021
. [all data]
Schneider and Ballschniter, 1996
Schneider, M.; Ballschniter, K.,
Separation of Diastereomeric and Enentiomeric Alkyl Nitrates - Systematic Approach to Chiral Discrimination on Cyclodextrin LIPODEX-D,
Chem. Eur. J., 1996, 2, 5, 539-544, https://doi.org/10.1002/chem.19960020513
. [all data]