1,3-Propanediol, dinitrate
- Formula: C3H6N2O6
- Molecular weight: 166.0895
- IUPAC Standard InChIKey: KOSAMXZBGUIISK-UHFFFAOYSA-N
- CAS Registry Number: 3457-90-7
- Chemical structure:
View 3d structure (requires JavaScript / HTML 5) - Other names: Trimethylene dinitrate; Trimethylene nitrate; 1,3-Propylene glycol dinitrate

Condensed phase thermochemistry data

Data compiled by: Hussein Y. Afeefy, Joel F. Liebman, and Stephen E. Stein
Quantity | Value | Units | Method | Reference | Comment |
---|---|---|---|---|---|
ΔcH°liquid | -1743. | kJ/mol | Ccb | Handrick, 1956 | Naval Powder Factory, 1951 |

Phase change data

Data compiled by: William E. Acree, Jr., James S. Chickos
Enthalpy of vaporization
ΔvapH (kJ/mol) | Temperature (K) | Method | Reference | Comment |
---|---|---|---|---|
74.3 ± 4.6 | 303. | A,GS | Stephenson and Malanowski, 1987 | Based on data from 293. to 313. K. See also Kemp, Goldhagen, et al., 1957. |

Normal alkane RI, non-polar column, temperature ramp

Column type | Active phase | I | Reference | Comment |
---|---|---|---|---|
Capillary | DB-1 | 1093. | Schneider and Ballschniter, 1996 | 40. C @ 3. min, 3. K/min; Tend: 250. C |
Capillary | DB-1 | 1093. | Schneider and Ballschniter, 1996 | 40. C @ 3. min, 3. K/min; Tend: 250. C |

References

Handrick, 1956
Handrick, G.R.,
Report of the study of pure explosive compounds. Part IV. Calculation of heat of combustion of organic compounds from structural features and calculation of power of high explosives, Rpt. C-58247 for the Office of the Chief of Ordnance, contract DA-19-020-ORD-47 by the Arthur D. Little, Inc., Cambridge, MA, 1956, 467-573. [all data]
Stephenson and Malanowski, 1987
Stephenson, Richard M.; Malanowski, Stanislaw,
Handbook of the Thermodynamics of Organic Compounds, 1987, https://doi.org/10.1007/978-94-009-3173-2
. [all data]
Kemp, Goldhagen, et al., 1957
Kemp, M.D.; Goldhagen, S.; Zihlman, F.A.,
Vapor Pressures and Cryoscopic Data for Some Aliphatic Dinitroxy and Trinitroxy Compounds,
J. Phys. Chem., 1957, 61, 2, 240-242, https://doi.org/10.1021/j150548a021
. [all data]
Schneider and Ballschniter, 1996
Schneider, M.; Ballschniter, K.,
Separation of Diastereomeric and Enentiomeric Alkyl Nitrates - Systematic Approach to Chiral Discrimination on Cyclodextrin LIPODEX-D,
Chem. Eur. J., 1996, 2, 5, 539-544, https://doi.org/10.1002/chem.19960020513
. [all data]