Peroxide, 1,1-dimethylethyl 1-methyl-1-phenylethyl
- Formula: C13H20O2
- Molecular weight: 208.2967
- IUPAC Standard InChIKey: BIISIZOQPWZPPS-UHFFFAOYSA-N
- CAS Registry Number: 3457-61-2
- Chemical structure:
View 3d structure (requires JavaScript / HTML 5) - Other names: tert-Butyl α,α-dimethylbenzyl peroxide; Peroxide, tert-butyl α,α-dimethylbenzyl; tert-Butyl cumene peroxide; tert-Butyl cumyl peroxide; Cumyl tert-butyl peroxide; Kayabutyl C; Trigonox T; 1,1-Dimethylethyl 1-methyl-1-phenylethyl peroxide; Luperco 801-XL; t-Butyl cumyl peroxide; Luperox 801

Condensed phase thermochemistry data

Data compiled by: Hussein Y. Afeefy, Joel F. Liebman, and Stephen E. Stein
Quantity | Value | Units | Method | Reference | Comment |
---|---|---|---|---|---|
ΔfH°liquid | -263.0 ± 5.8 | kJ/mol | Ccb | Van-Chin-Syan, Dolbneva, et al., 1984 | see Dolbneva, Dikii, et al., 1984 |
Quantity | Value | Units | Method | Reference | Comment |
ΔcH°liquid | -7710.5 ± 5.8 | kJ/mol | Ccb | Van-Chin-Syan, Dolbneva, et al., 1984 | see Dolbneva, Dikii, et al., 1984; Corresponding ΔfHºliquid = -263.4 kJ/mol (simple calculation by NIST; no Washburn corrections) |

References

Van-Chin-Syan, Dolbneva, et al., 1984
Van-Chin-Syan, Yu.Ya.; Dolbneva, T.N.; Dikii, M.A.; Cuchmarev, S.K.,
Thermochemistry of derivatives of isopropylbenzene and p-diisopropylbenzene,
Russ. J. Phys. Chem. (Engl. Transl.), 1984, 58, 1783-1785. [all data]
Dolbneva, Dikii, et al., 1984
Dolbneva, T.N.; Dikii, M.A.; Wang, C.H.; Gevus, O.I.,
Thermodynamic properties of derivatives of diisopropylbenzene, Deposited Document, SPSTL 293 Khp-D82. Chem. Abst. 101:22824c, 1984, 1-6. [all data]