2,4,4-trimethyl-3-hexanone
- Formula: C9H18O
- Molecular weight: 142.2386
- IUPAC Standard InChIKey: RJKMZBWVYZUKLA-UHFFFAOYSA-N
- CAS Registry Number: 34575-34-3
- Chemical structure:
View 3d structure (requires JavaScript / HTML 5) - Permanent link for this species. Use this link for bookmarking this species for future reference.

Phase change data

Data compiled by: Thermodynamics Research Center, NIST Boulder Laboratories, Chris Muzny director
Quantity | Value | Units | Method | Reference | Comment |
---|---|---|---|---|---|
Tboil | 435. | K | N/A | Mosher, 1940 | Uncertainty assigned by TRC = 3. K |
Tboil | 434. | K | N/A | Nazarov, 1937 | Uncertainty assigned by TRC = 5. K |
Tboil | 433. | K | N/A | Haller and Bauer, 1913 | Uncertainty assigned by TRC = 5. K |

References

Mosher, 1940
Mosher, W.A.,
, Ph.D. Dissertation, Penn. State Univ., Univ. Park, 1940. [all data]
Nazarov, 1937
Nazarov, I.N.,
Synthesis of Tertiary Alcohols of the General FOrmulas R3CC(OH)MeCHR2 and R3CC(OH)MeCR3. Action of Methylmagnesium Bromide on Branched Ketones,
Chem. Ber., 1937, 70, 599-605. [all data]
Haller and Bauer, 1913
Haller, A.; Bauer, E.,
Ann. Chim. (Paris), 1913, 29, 8, 313. [all data]