1-Hexanol, 3,5,5-trimethyl-
- Formula: C9H20O
- Molecular weight: 144.2545
- IUPAC Standard InChIKey: BODRLKRKPXBDBN-UHFFFAOYSA-N
- CAS Registry Number: 3452-97-9
- Chemical structure:
View 3d structure (requires JavaScript / HTML 5) - Other names: Nonylol; 3,5,5-Trimethyl-1-hexanol; 3,5,5-Trimethylhexanol; 3,5,5-Trimethyl n-hexanol; 3,5,5-Trimethylhexan-1-ol; 3,5,5-Trimethylhexyl alcohol; i-Nonyl alcohol; NSC 83151; NSC 97226

Condensed phase thermochemistry data

Data compiled by: Hussein Y. Afeefy, Joel F. Liebman, and Stephen E. Stein
Quantity | Value | Units | Method | Reference | Comment |
---|---|---|---|---|---|
ΔfH°liquid | -456.9 | kJ/mol | Ccb | Nicholson, 1960 | |
Quantity | Value | Units | Method | Reference | Comment |
ΔcH°liquid | -5943. ± 3. | kJ/mol | Ccb | Nicholson, 1960 | Corresponding ΔfHºliquid = -456.5 kJ/mol (simple calculation by NIST; no Washburn corrections) |

Phase change data

Data compiled as indicated in comments:
BS - Robert L. Brown and Stephen E. Stein
TRC - Thermodynamics Research Center, NIST Boulder Laboratories, Chris Muzny director
AC - William E. Acree, Jr., James S. Chickos
Quantity | Value | Units | Method | Reference | Comment |
---|---|---|---|---|---|
Tboil | 467.2 | K | N/A | Weast and Grasselli, 1989 | BS |
Tboil | 463.15 | K | N/A | Gresham, Brooks, et al., 1952 | Uncertainty assigned by TRC = 4. K; TRC |
Tboil | 464.15 | K | N/A | Freedman and Becker, 1951 | Uncertainty assigned by TRC = 4. K; TRC |
Tboil | 466.65 | K | N/A | Bruner, 1949 | Uncertainty assigned by TRC = 4. K; TRC |
Tboil | 466.05 | K | N/A | Keulemans, Kwantes, et al., 1948 | Uncertainty assigned by TRC = 3. K; TRC |
Quantity | Value | Units | Method | Reference | Comment |
ΔvapH° | 67.9 ± 0.4 | kJ/mol | GS | Roganov, Pisarev, et al., 2005 | Based on data from 288. to 324. K.; AC |

Normal alkane RI, non-polar column, custom temperature program

Column type | Active phase | I | Reference | Comment |
---|---|---|---|---|
Capillary | SE-30 | 1041. | Vinogradov, 2004 | Program: not specified |
Capillary | SPB-5 | 1049. | Begnaud, Pérès, et al., 2003 | 60. m/0.32 mm/1. μm; Program: not specified |

Normal alkane RI, polar column, custom temperature program

Column type | Active phase | I | Reference | Comment |
---|---|---|---|---|
Capillary | Carbowax 20M | 1480. | Vinogradov, 2004 | Program: not specified |

References

Nicholson, 1960
Nicholson, G.R.,
478. The heats of combustion of butanal and heptanal,
J. Chem. Soc., 1960, 2377-2378. [all data]
Weast and Grasselli, 1989
CRC Handbook of Data on Organic Compounds, 2nd Editon, Weast,R.C and Grasselli, J.G., ed(s)., CRC Press, Inc., Boca Raton, FL, 1989, 1. [all data]
Gresham, Brooks, et al., 1952
Gresham, W.F.; Brooks, R.E.; Bruner, W.M.,
, 1952. [all data]
Freedman and Becker, 1951
Freedman, R.W.; Becker, K.,
The reaction of grignard reagents with 3,4-epoxy-1-butene: II ethylmagnesium bromide and diethylmagnesium,
J. Org. Chem., 1951, 16, 1701. [all data]
Bruner, 1949
Bruner, W.M.,
Ind. Eng. Chem. 41, 1949, 2860 1949. [all data]
Keulemans, Kwantes, et al., 1948
Keulemans, A.I.M.; Kwantes, A.; van Bavel, T.,
Recl. Trav. Chim. Pays-Bas, 1948, 67, 298. [all data]
Roganov, Pisarev, et al., 2005
Roganov, Gennady N.; Pisarev, Pavel N.; Emel'yanenko, Vladimir N.; Verevkin, Sergey P.,
Measurement and Prediction of Thermochemical Properties. Improved Benson-Type Increments for the Estimation of Enthalpies of Vaporization and Standard Enthalpies of Formation of Aliphatic Alcohols,
J. Chem. Eng. Data, 2005, 50, 4, 1114-1124, https://doi.org/10.1021/je049561m
. [all data]
Vinogradov, 2004
Vinogradov, B.A.,
Production, composition, properties and application of essential oils, 2004, retrieved from http://viness.narod.ru. [all data]
Begnaud, Pérès, et al., 2003
Begnaud, F.; Pérès, C.; Berdagué, J.-L.,
Characterization of volatile effluents of livestock buildings by solid-phase microextraction,
Int. J. Environ. Anal. Chem., 2003, 83, 10, 837-849, https://doi.org/10.1080/03067310310001603349
. [all data]