1-Eicosene
- Formula: C20H40
- Molecular weight: 280.5316
- IUPAC Standard InChIKey: VAMFXQBUQXONLZ-UHFFFAOYSA-N
- CAS Registry Number: 3452-07-1
- Chemical structure:
View 3d structure (requires JavaScript / HTML 5) - Other names: α-Eicosene; Cetyl ethylene; 1-Icosene; Eicos-1-ene; Icos-1-ene; Neodene 20; NSC 77138; Eicosene

Phase change data

Data compiled as indicated in comments:
BS - Robert L. Brown and Stephen E. Stein
AC - William E. Acree, Jr., James S. Chickos
Quantity | Value | Units | Method | Reference | Comment |
---|---|---|---|---|---|
Tboil | 614.2 | K | N/A | Weast and Grasselli, 1989 | BS |
Quantity | Value | Units | Method | Reference | Comment |
ΔvapH° | 100. | kJ/mol | N/A | Reid, 1972 | AC |
Reduced pressure boiling point
Tboil (K) | Pressure (bar) | Reference | Comment |
---|---|---|---|
424.2 | 0.001 | Weast and Grasselli, 1989 | BS |
Enthalpy of vaporization
ΔvapH (kJ/mol) | Temperature (K) | Method | Reference | Comment |
---|---|---|---|---|
74.3 | 493. | N/A | Dykyj, Svoboda, et al., 1999 | Based on data from 478. to 638. K.; AC |
65. | 588. | A | Stephenson and Malanowski, 1987 | Based on data from 573. to 615. K.; AC |

Reaction thermochemistry data

Data compiled by: Hussein Y. Afeefy, Joel F. Liebman, and Stephen E. Stein
Individual Reactions
By formula: H2 + C20H40 = C20H42
Quantity | Value | Units | Method | Reference | Comment |
---|---|---|---|---|---|
ΔrH° | -126.9 ± 1.3 | kJ/mol | Chyd | Rogers and Skanupong, 1974 | liquid phase; solvent: Hexane |

Normal alkane RI, non-polar column, custom temperature program

Data compiled by: NIST Mass Spectrometry Data Center, William E. Wallace, director

Column type CapillaryCapillaryCapillaryCapillary
Active phase DB-5DB-5DB-5Elite-5 MS
Column length (m) 30.30.30.30.
Carrier gas  HeliumHeliumHelium
Substrate
Column diameter (mm) 0.320.320.320.25
Phase thickness (μm)    0.25
Program not specifiednot specifiednot specified60 0C (1 min) 1.5 0C/min -> 185 0C (1 min) 9 0C/min -> 275 0C (2 min)
I 1994.1994.1994.1992.
ReferenceYusuf and Bewaji, 2011Yusuf and Bewaji, 2011, 2Yusuf and Bewaji, 2011, 2Kapoor, Singh, et al., 2009
Comment MSDC-RI MSDC-RI MSDC-RI MSDC-RI

Van Den Dool and Kratz RI, polar column, custom temperature program

Data compiled by: NIST Mass Spectrometry Data Center, William E. Wallace, director

Column type Capillary
Active phase CP-Wax 52CB
Column length (m) 60.
Carrier gas He
Substrate
Column diameter (mm) 0.25
Phase thickness (μm) 0.25
Program 45C(5min) => 10C/min => 80C => 2C/min => 240C
I 2047.
ReferenceCondurso, Verzera, et al., 2006
Comment MSDC-RI

References

Weast and Grasselli, 1989
CRC Handbook of Data on Organic Compounds, 2nd Editon, Weast,R.C and Grasselli, J.G., ed(s)., CRC Press, Inc., Boca Raton, FL, 1989, 1. [all data]
Reid, 1972
Reid, Robert C.,
Handbook on vapor pressure and heats of vaporization of hydrocarbons and related compounds, R. C. Wilhort and B. J. Zwolinski, Texas A Research Foundation. College Station, Texas(1971). 329 pages.$10.00,
AIChE J., 1972, 18, 6, 1278-1278, https://doi.org/10.1002/aic.690180637
. [all data]
Dykyj, Svoboda, et al., 1999
Dykyj, J.; Svoboda, J.; Wilhoit, R.C.; Frenkel, M.L.; Hall, K.R.,
Vapor Pressure of Chemicals: Part A. Vapor Pressure and Antoine Constants for Hydrocarbons and Sulfur, Selenium, Tellurium and Hydrogen Containing Organic Compounds, Springer, Berlin, 1999, 373. [all data]
Stephenson and Malanowski, 1987
Stephenson, Richard M.; Malanowski, Stanislaw,
Handbook of the Thermodynamics of Organic Compounds, 1987, https://doi.org/10.1007/978-94-009-3173-2
. [all data]
Rogers and Skanupong, 1974
Rogers, D.W.; Skanupong, S.,
Heats of hydrogenation of sixteen terminal monoolefins. The alternating effect,
J. Phys. Chem., 1974, 78, 2569-2572. [all data]