Benzophenone, 2-amino-2'-fluoro-5-nitro
- Formula: C13H9FN2O3
- Molecular weight: 260.2206
- IUPAC Standard InChIKey: ZTEHQPVGEHUXHI-UHFFFAOYSA-N
- CAS Registry Number: 344-80-9
- Chemical structure:
View 3d structure (requires JavaScript / HTML 5) - Other names: 2-amino-5-nitro-2'-fluorobenzophenone; 2-Amino-2'-fluoro-5-nitrobenzophenone

Kovats' RI, non-polar column, isothermal

Column type | Active phase | Temperature (C) | I | Reference | Comment |
---|---|---|---|---|---|
Capillary | SPB-1 | 250. | 2401. | Lora-Tamayo, Rams, et al., 1986 | He; Column length: 25. m; Column diameter: 0.20 mm |
Packed | SE-30 | 220. | 2344. | Schütz, 1982 | N2 |

Normal alkane RI, non-polar column, custom temperature program

Column type | Active phase | I | Reference | Comment |
---|---|---|---|---|
Capillary | HP-5MS | 2335. | Augsburger, Rivier, et al., 1998 | 30. m/0.25 mm/0.25 μm; Program: not specified |
Capillary | Polydimethyl siloxanes | 2363. | Schutz and Wollrab A., 1988 | Program: not specified |
Other | Methyl Silicone | 2363. | Ardrey and Moffat, 1981 | Program: not specified |

References

Lora-Tamayo, Rams, et al., 1986
Lora-Tamayo, C.; Rams, M.A.; Chacon, J.M.R.,
Gas Chromatographic Data for 187 Nitrogen- or Phosphorus-Containing Drugs and Metabolites of Toxicological Interest Analysed on Methyl Silicone Capillary Columns,
J. Chromatogr., 1986, 374, 73-85, https://doi.org/10.1016/S0378-4347(00)83254-5
. [all data]
Schütz, 1982
Schütz, H.,
Benzodiazepines, Springer-Verlag, New York, 1982, 438. [all data]
Augsburger, Rivier, et al., 1998
Augsburger, M.; Rivier, L.; Mangin, P.,
Comparison of different immunoassays and GC-MS screening of benzodiazepines in urine,
J. Pharm. Biomed. Anal., 1998, 18, 4-5, 681-687, https://doi.org/10.1016/S0731-7085(98)00266-0
. [all data]
Schutz and Wollrab A., 1988
Schutz, H.; Wollrab A.,
The significance of the retention index in toxicologic analysis II,
Pharmazie in unzerer Zeit, 1988, 17, 4, 97-101. [all data]
Ardrey and Moffat, 1981
Ardrey, R.E.; Moffat, A.C.,
Gas-liquid chromatographic retention indices of 1318 substances of toxicological interest on SE-30 or OV-1 stationary phase,
J. Chromatogr., 1981, 220, 3, 195-252, https://doi.org/10.1016/S0021-9673(00)81925-1
. [all data]