Benzene, 1-chloro-4-nitro- anion
- Formula: C6H4ClNO2-
- Molecular weight: 157.555
- CAS Registry Number: 34473-09-1

Gas phase thermochemistry data

Data compiled by: John E. Bartmess
Quantity | Value | Units | Method | Reference | Comment |
---|---|---|---|---|---|
ΔfH°gas | -84. ± 10. | kJ/mol | R-EA | Chowdhury, Heinis, et al., 1986 | ΔGea(423 K) = -28.2 kcal/mol; ΔSea = -2.0 eu. |

Ion clustering data

Data compiled as indicated in comments:
B - John E. Bartmess
M - Michael M. Meot-Ner (Mautner) and Sharon G. Lias
Clustering reactions
C6H4ClNO2- + = (C6H4ClNO2- •
)
By formula: C6H4ClNO2- + CH4O = (C6H4ClNO2- • CH4O)
Quantity | Value | Units | Method | Reference | Comment |
---|---|---|---|---|---|
ΔrG° | 23. ± 6.7 | kJ/mol | IMRE | Chowdhury, Grimsrud, et al., 1987 | gas phase; Free energy affinity at 70°C.; B |
Free energy of reaction
ΔrG° (kJ/mol) | T (K) | Method | Reference | Comment |
---|---|---|---|---|
23. | 343. | PHPMS | Chowdhury, 1987 | gas phase; M |
C6H4ClNO2- + = (C6H4ClNO2- •
)
By formula: C6H4ClNO2- + C2H3N = (C6H4ClNO2- • C2H3N)
Quantity | Value | Units | Method | Reference | Comment |
---|---|---|---|---|---|
ΔrG° | 25. ± 6.7 | kJ/mol | IMRE | Chowdhury, Grimsrud, et al., 1987 | gas phase; Free energy affinity at 70°C.; B |
Free energy of reaction
ΔrG° (kJ/mol) | T (K) | Method | Reference | Comment |
---|---|---|---|---|
25. | 343. | PHPMS | Chowdhury, 1987 | gas phase; M |
C6H4ClNO2- + = (C6H4ClNO2- •
)
By formula: C6H4ClNO2- + C2H6OS = (C6H4ClNO2- • C2H6OS)
Quantity | Value | Units | Method | Reference | Comment |
---|---|---|---|---|---|
ΔrG° | 32. ± 6.7 | kJ/mol | IMRE | Chowdhury, Grimsrud, et al., 1987 | gas phase; Free energy affinity at 70°C.; B |
Free energy of reaction
ΔrG° (kJ/mol) | T (K) | Method | Reference | Comment |
---|---|---|---|---|
32. | 343. | PHPMS | Chowdhury, 1987 | gas phase; M |
C6H4ClNO2- + = C6H4ClF4NO2Si-
By formula: C6H4ClNO2- + F4Si = C6H4ClF4NO2Si-
Quantity | Value | Units | Method | Reference | Comment |
---|---|---|---|---|---|
ΔrH° | 134. ± 8.4 | kJ/mol | TDAs | Williamson, Knighton, et al., 2001 | gas phase; at 150 C; B |
Quantity | Value | Units | Method | Reference | Comment |
ΔrG° | 50.2 ± 2.5 | kJ/mol | TDAs | Williamson, Knighton, et al., 2001 | gas phase; at 150 C; B |

Reaction thermochemistry data

Data compiled as indicated in comments:
B - John E. Bartmess
M - Michael M. Meot-Ner (Mautner) and Sharon G. Lias

Individual Reactions

C6H4ClNO2- + Methyl Alcohol = (C6H4ClNO2- • Methyl Alcohol)

By formula: C6H4ClNO2- + CH4O = (C6H4ClNO2- • CH4O)

Quantity Value Units Method Reference Comment
Δr23. ± 6.7kJ/molIMREChowdhury, Grimsrud, et al., 1987gas phase; Free energy affinity at 70°C.; B

Free energy of reaction

ΔrG° (kJ/mol) T (K) Method Reference Comment
23.343.PHPMSChowdhury, 1987gas phase; M

C6H4ClNO2- + Dimethyl Sulfoxide = (C6H4ClNO2- • Dimethyl Sulfoxide)

By formula: C6H4ClNO2- + C2H6OS = (C6H4ClNO2- • C2H6OS)

Quantity Value Units Method Reference Comment
Δr32. ± 6.7kJ/molIMREChowdhury, Grimsrud, et al., 1987gas phase; Free energy affinity at 70°C.; B

Free energy of reaction

ΔrG° (kJ/mol) T (K) Method Reference Comment
32.343.PHPMSChowdhury, 1987gas phase; M

C6H4ClNO2- + Acetonitrile = (C6H4ClNO2- • Acetonitrile)

By formula: C6H4ClNO2- + C2H3N = (C6H4ClNO2- • C2H3N)

Quantity Value Units Method Reference Comment
Δr25. ± 6.7kJ/molIMREChowdhury, Grimsrud, et al., 1987gas phase; Free energy affinity at 70°C.; B

Free energy of reaction

ΔrG° (kJ/mol) T (K) Method Reference Comment
25.343.PHPMSChowdhury, 1987gas phase; M

C6H4ClNO2- + Silicon tetrafluoride = C6H4ClF4NO2Si-

By formula: C6H4ClNO2- + F4Si = C6H4ClF4NO2Si-

Quantity Value Units Method Reference Comment
Δr134. ± 8.4kJ/molTDAsWilliamson, Knighton, et al., 2001gas phase; at 150 C; B
Quantity Value Units Method Reference Comment
Δr50.2 ± 2.5kJ/molTDAsWilliamson, Knighton, et al., 2001gas phase; at 150 C; B

References

Chowdhury, Heinis, et al., 1986
Chowdhury, S.; Heinis, T.; Grimsrud, E.P.; Kebarle, P.,
Entropy Changes and Electron Affinities from Gas-Phase Electron Transfer Equilibria: A- + B = A + B-,
J. Phys. Chem., 1986, 90, 12, 2747, https://doi.org/10.1021/j100403a037
. [all data]
Chowdhury, Grimsrud, et al., 1987
Chowdhury, S.; Grimsrud, E.P.; Kebarle, P.,
Bonding of Charged Delocalized Anions to Protic and Dipolar Aprotic Solvent Molecules,
J. Phys. Chem., 1987, 91, 10, 2551, https://doi.org/10.1021/j100294a021
. [all data]
Chowdhury, 1987
Chowdhury, S. Grimsrud,
Bonding of Charge Delocalized Anions to Protic and Dipolar Aprotic Solvents,
J. Phys. Chem., 1987, 91, 10, 2551, https://doi.org/10.1021/j100294a021
. [all data]
Williamson, Knighton, et al., 2001
Williamson, D.H.; Knighton, W.B.; Grimsrud, E.P.,
Lewis acid-base interactions of SiF4 with molecular anions formed by electron capture reactions,
Int. J. Mass Spectrom., 2001, 206, 1-2, 53-61, https://doi.org/10.1016/S1387-3806(00)00388-2
. [all data]