Benzyl alcohol, α,α-dimethyl-p-isopropyl-
- Formula: C12H18O
- Molecular weight: 178.2707
- IUPAC Standard InChIKey: VBSMBCNJCBKQFP-UHFFFAOYSA-N
- CAS Registry Number: 3445-42-9
- Chemical structure:
View 3d structure (requires JavaScript / HTML 5) - Other names: Benzenemethanol, α,α-dimethyl-4-(1-methylethyl)-; α,α-Dimethyl-p-isopropylbenzyl alcohol; p-Hydroxydiisopropylbenzene; p-Oxidiisopropylbenzene; 2-(4-Isopropylphenyl)-2-propanol

Condensed phase thermochemistry data

Data compiled by: Hussein Y. Afeefy, Joel F. Liebman, and Stephen E. Stein
Quantity | Value | Units | Method | Reference | Comment |
---|---|---|---|---|---|
ΔfH°solid | -343.7 ± 2.8 | kJ/mol | Ccb | Van-Chin-Syan, Dolbneva, et al., 1984 | |
Quantity | Value | Units | Method | Reference | Comment |
ΔcH°solid | -6950.9 ± 2.8 | kJ/mol | Ccb | Van-Chin-Syan, Dolbneva, et al., 1984 | Corresponding ΔfHºsolid = -343.7 kJ/mol (simple calculation by NIST; no Washburn corrections) |

References

Van-Chin-Syan, Dolbneva, et al., 1984
Van-Chin-Syan, Yu.Ya.; Dolbneva, T.N.; Dikii, M.A.; Cuchmarev, S.K.,
Thermochemistry of derivatives of isopropylbenzene and p-diisopropylbenzene,
Russ. J. Phys. Chem. (Engl. Transl.), 1984, 58, 1783-1785. [all data]