Tetradecanoic acid, 2-hydroxy-1-(hydroxymethyl)ethyl ester

Condensed phase thermochemistry data

Data compiled by: Hussein Y. Afeefy, Joel F. Liebman, and Stephen E. Stein

Quantity Value Units Method Reference Comment
Δfsolid-1212.9 ± 2.1kJ/molCcbSilbert, Daubert, et al., 1965
Quantity Value Units Method Reference Comment
Δcsolid-10335.9 ± 1.8kJ/molCcbSilbert, Daubert, et al., 1965Corresponding Δfsolid = -1212.9 kJ/mol (simple calculation by NIST; no Washburn corrections)

References

Silbert, Daubert, et al., 1965
Silbert, L.S.; Daubert, B.F.; Mason, L.S., The heats of combustion, formation, and isomerization of isomeric monoglycerides, J. Phys. Chem., 1965, 69, 2887-2894. [all data]