5,6,7,8-Tetrahydroquinoxaline
- Formula: C8H10N2
- Molecular weight: 134.1784
- IUPAC Standard InChIKey: XCZPDOCRSYZOBI-UHFFFAOYSA-N
- CAS Registry Number: 34413-35-9
- Chemical structure:
View 3d structure (requires JavaScript / HTML 5) - Other names: Quinoxaline, 5,6,7,8-tetrahydro-

Phase change data

Data compiled by: Robert L. Brown and Stephen E. Stein
Reduced pressure boiling point
Tboil (K) | Pressure (bar) | Reference |
---|---|---|
358.2 | 0.004 | Aldrich Chemical Company Inc., 1990 |

Normal alkane RI, non-polar column, temperature ramp

View large format table.

Column type Active phase I Reference Comment
CapillaryUltra-11173.Du, Clery, et al., 200850. m/0.20 mm/0.33 μm, Helium, 2. K/min, 280. C @ 20. min; Tstart: 50. C
CapillaryHP-51212.Du, Clery, et al., 200850. m/0.20 mm/0.33 μm, Helium, 10. K/min, 280. C @ 8.5 min; Tstart: 50. C

Normal alkane RI, non-polar column, custom temperature program

View large format table.

Column type Active phase I Reference Comment
CapillaryHP-51223.Hartmann, 200330. m/0.25 mm/0.25 μm, He; Program: 50 C(1min) => 20C/min => 80C => 25C/min => 250C (3 min)
CapillaryHP-51226.Hartmann, 200330. m/0.25 mm/0.25 μm, He; Program: 50 C(1min) => 20C/min => 80C => 25C/min => 250C (3 min)

Normal alkane RI, polar column, temperature ramp

View large format table.

Column type Active phase I Reference Comment
CapillaryDB-Wax1717.Wong and Bernhard, 1988He, 70. C @ 8. min, 2. K/min; Column length: 30. m; Column diameter: 0.25 mm; Tend: 160. C

References

Aldrich Chemical Company Inc., 1990
Aldrich Chemical Company Inc.,
Catalog Handbook of Fine Chemicals, Aldrich Chemical Company, Inc., Milwaukee WI, 1990, 1. [all data]