Pyrrolidine, 3-methyl-
- Formula: C5H11N
- Molecular weight: 85.1475
- IUPAC Standard InChIKey: KYINPWAJIVTFBW-UHFFFAOYSA-N
- CAS Registry Number: 34375-89-8
- Chemical structure:
View 3d structure (requires JavaScript / HTML 5) - Other names: 3-Methylpyrrolidine

Condensed phase thermochemistry data

Data compiled by: Eugene S. Domalski and Elizabeth D. Hearing
Quantity | Value | Units | Method | Reference | Comment |
---|---|---|---|---|---|
S°liquid | 236.43 | J/mol*K | N/A | Steele, Chirico, et al., 1986 |
Constant pressure heat capacity of liquid
Cp,liquid (J/mol*K) | Temperature (K) | Reference | Comment |
---|---|---|---|
188.28 | 298.15 | Steele, Chirico, et al., 1986 | T = 10 to 400 K. |

Phase change data

Data compiled by: Eugene S. Domalski and Elizabeth D. Hearing
Quantity | Value | Units | Method | Reference | Comment |
---|---|---|---|---|---|
Tfus | 170.402 | K | N/A | Steele, Chirico, et al., 1986 |

References

Steele, Chirico, et al., 1986
Steele, W.V.; Chirico, R.D.; Collier, W.B.; Hossenlopp, I.A.; Nguyen, A.; Strube, M.M.,
Thermochemical and thermophysical properties of organic nitrogen compounds found in fossil materials,
NIPER Report, 1986, 188, 112p. [all data]