3,3-dimethylpyrrolidine
- Formula: C6H13N
- Molecular weight: 99.1741
- IUPAC Standard InChIKey: XBQNZPDIRJPFAI-UHFFFAOYSA-N
- CAS Registry Number: 3437-30-7
- Chemical structure:
View 3d structure (requires JavaScript / HTML 5) - Species with the same structure:

Phase change data

Data compiled by: Thermodynamics Research Center, NIST Boulder Laboratories, Chris Muzny director
Quantity | Value | Units | Method | Reference | Comment |
---|---|---|---|---|---|
Tboil | 388. | K | N/A | Brown and van Gulick, 1955 | Uncertainty assigned by TRC = 2. K |

References

Brown and van Gulick, 1955
Brown, R.F.; van Gulick, N.M.,
The Preparation of Geminally Substituted 4-Bromobutylamines II. 4-Bromo-2,2-dialkyl- and diarylbutylamines,
J. Am. Chem. Soc., 1955, 77, 1083. [all data]