1,1,1,2-Tetramethoxyethane
- Formula: C6H14O4
- Molecular weight: 150.1730
- IUPAC Standard InChIKey: VPZFYLQMPOIPKH-UHFFFAOYSA-N
- CAS Registry Number: 34359-77-8
- Chemical structure:
View 3d structure (requires JavaScript / HTML 5) - Permanent link for this species. Use this link for bookmarking this species for future reference.

Phase change data

Data compiled by: Hussein Y. Afeefy, Joel F. Liebman, and Stephen E. Stein
Quantity | Value | Units | Method | Reference | Comment |
---|---|---|---|---|---|
ΔvapH° | 47.2 ± 4.2 | kJ/mol | E | Guthrie and Cullimore, 1980 |

Reaction thermochemistry data

Data compiled by: Hussein Y. Afeefy, Joel F. Liebman, and Stephen E. Stein
Individual Reactions
By formula: C6H14O4 + H2O = C4H8O3 + 2CH4O
Quantity | Value | Units | Method | Reference | Comment |
---|---|---|---|---|---|
ΔrH° | -52.43 ± 0.50 | kJ/mol | Eqk | Guthrie and Cullimore, 1980 | liquid phase |

References

Guthrie and Cullimore, 1980
Guthrie, J.P.; Cullimore, P.A.,
Effect of the acyl substituent on the equilibrium constant for hydration of esters,
Can. J. Chem., 1980, 58, 1281-1294. [all data]