Benzene, 1-bromo-2-(bromomethyl)-
- Formula: C7H6Br2
- Molecular weight: 249.931
- IUPAC Standard InChIKey: LZSYGJNFCREHMD-UHFFFAOYSA-N
- CAS Registry Number: 3433-80-5
- Chemical structure:
View 3d structure (requires JavaScript / HTML 5) - Other names: o-Bromobenzyl bromide; 2-Bromobenzyl bromide; α-2-dibromotoluene

Phase change data

Data compiled by: Robert L. Brown and Stephen E. Stein
Quantity | Value | Units | Method | Reference | Comment |
---|---|---|---|---|---|
Tfus | 304. | K | N/A | Buckingham and Donaghy, 1982 |
Reduced pressure boiling point
Tboil (K) | Pressure (bar) | Reference |
---|---|---|
402.2 | 0.025 | Weast and Grasselli, 1989 |
416. to 420. | 0.033 | Frinton Laboratories Inc., 1986 |
393. to 403. | 0.017 | Buckingham and Donaghy, 1982 |

References

Buckingham and Donaghy, 1982
Buckingham, J.; Donaghy, S.M.,
Dictionary of Organic Compounds: Fifth Edition, Chapman and Hall, New York, 1982, 1. [all data]
Weast and Grasselli, 1989
CRC Handbook of Data on Organic Compounds, 2nd Editon, Weast,R.C and Grasselli, J.G., ed(s)., CRC Press, Inc., Boca Raton, FL, 1989, 1. [all data]
Frinton Laboratories Inc., 1986
Frinton Laboratories Inc.,
Catalog Number 11, Frinton Laboratories Inc., Vineland, NJ, 1986, 99. [all data]