2-Piperidinemethanol
- Formula: C6H13NO
- Molecular weight: 115.1735
- IUPAC Standard InChIKey: PRAYXGYYVXRDDW-UHFFFAOYSA-N
- CAS Registry Number: 3433-37-2
- Chemical structure:
View 3d structure (requires JavaScript / HTML 5) - Other names: piperidin-2-ylmethanol

Phase change data

Data compiled as indicated in comments:
BS - Robert L. Brown and Stephen E. Stein
TRC - Thermodynamics Research Center, NIST Boulder Laboratories, Chris Muzny director
AC - William E. Acree, Jr., James S. Chickos
Quantity | Value | Units | Method | Reference | Comment |
---|---|---|---|---|---|
Tfus | 340. | K | N/A | Adkins and Pavlic, 1947 | Uncertainty assigned by TRC = 3. K; TRC |
Quantity | Value | Units | Method | Reference | Comment |
ΔsubH° | 93.0 ± 0.5 | kJ/mol | C | Ribeiro da Silva and Cabral, 2006 | AC |
Reduced pressure boiling point
Tboil (K) | Pressure (bar) | Reference | Comment |
---|---|---|---|
374.2 | 0.008 | Aldrich Chemical Company Inc., 1990 | BS |

References

Adkins and Pavlic, 1947
Adkins, H.; Pavlic, A.A.,
Hydrogenation of Esters to Alcohols over Raney Nickel. I.,
J. Am. Chem. Soc., 1947, 69, 3039-41. [all data]
Ribeiro da Silva and Cabral, 2006
Ribeiro da Silva, Manuel A.V.; Cabral, Joana I.T.A.,
Standard molar enthalpies of formation of 2-, 3-, and 4-piperidinomethanol isomers,
The Journal of Chemical Thermodynamics, 2006, 38, 8, 1008-1012, https://doi.org/10.1016/j.jct.2005.10.014
. [all data]
Aldrich Chemical Company Inc., 1990
Aldrich Chemical Company Inc.,
Catalog Handbook of Fine Chemicals, Aldrich Chemical Company, Inc., Milwaukee WI, 1990, 1. [all data]