o,p'-DDE
- Formula: C14H8Cl4
- Molecular weight: 318.025
- IUPAC Standard InChIKey: ZDYJWDIWLRZXDB-UHFFFAOYSA-N
- CAS Registry Number: 3424-82-6
- Chemical structure:
View 3d structure (requires JavaScript / HTML 5) - Other names: Benzene, 1-chloro-2-[2,2-dichloro-1-(4-chlorophenyl)ethenyl]-; Ethylene, 1,1-dichloro-2-(o-chlorophenyl)-2-(p-chlorophenyl)-; 1,1-Dichloro-2-(o-chlorophenyl)-2-(p-chlorophenyl)ethylene; 2-(2-Chlorophenyl)-2-(4-chlorophenyl)-1,1-dichloroethylene; 1,1-Dichloro-2-(o-chlorophenyl)-2-(p-chlorophenyl)ethene; Ethylene, 1-(o-chlorophenyl)-1-(p-chlorophenyl)-2,2-dichloro-; 2,4'-DDE; NSC 59908; o,p-DDE; 2,2,o,p'-tetrachlorovinylidenebisbenzene; 1-Chloro-2-(2,2-dichloro-1-(4-chlorophenylethenyl)benzene

Phase change data

Data compiled as indicated in comments:
TRC - Thermodynamics Research Center, NIST Boulder Laboratories, Chris Muzny director
AC - William E. Acree, Jr., James S. Chickos
Quantity | Value | Units | Method | Reference | Comment |
---|---|---|---|---|---|
Tfus | 351.54 | K | N/A | Donnelly, Drewes, et al., 1990 | Uncertainty assigned by TRC = 0.2 K; TRC |
Tfus | 351.4 | K | N/A | Plato and Glasgow, 1969 | Uncertainty assigned by TRC = 0.2 K; TRC |
Enthalpy of fusion
ΔfusH (kJ/mol) | Temperature (K) | Method | Reference | Comment |
---|---|---|---|---|
23.84 | 349.8 | DSC | Donnelly, Drewes, et al., 1990, 2 | AC |

Kovats' RI, non-polar column, custom temperature program

View large format table.

Column type Active phase I Reference Comment
PackedSE-302070.Ramsey, Lee, et al., 1980He, Chromosorb G HP (80-100 mesh); Column length: 1.5 m; Program: not specified

Van Den Dool and Kratz RI, non-polar column, temperature ramp

View large format table.

Column type Active phase I Reference Comment
CapillaryOV-12051.de Paoli, Taccheo-Barbina, et al., 199125. m/0.32 mm/0.10 μm, 160. C @ 1. min, 1. K/min; Tend: 240. C
CapillaryOV-12054.de Paoli, Taccheo-Barbina, et al., 199125. m/0.32 mm/0.10 μm, 160. C @ 1. min, 1. K/min; Tend: 240. C
CapillaryOV-12055.de Paoli, Taccheo-Barbina, et al., 199125. m/0.32 mm/0.10 μm, 160. C @ 1. min, 1.3 K/min; Tend: 240. C
CapillaryOV-12058.de Paoli, Taccheo-Barbina, et al., 199125. m/0.32 mm/0.10 μm, 160. C @ 1. min, 1.3 K/min; Tend: 240. C
CapillaryOV-12050.de Paoli, Taccheo-Barbina, et al., 199125. m/0.32 mm/0.10 μm, 160. C @ 1. min, 1.5 K/min; Tend: 240. C
CapillaryOV-12053.de Paoli, Taccheo-Barbina, et al., 199125. m/0.32 mm/0.10 μm, 160. C @ 1. min, 1.5 K/min; Tend: 240. C
CapillaryOV-12054.de Paoli, Taccheo-Barbina, et al., 199125. m/0.32 mm/0.10 μm, 160. C @ 1. min, 2. K/min; Tend: 240. C
CapillaryOV-12057.de Paoli, Taccheo-Barbina, et al., 199125. m/0.32 mm/0.10 μm, 160. C @ 1. min, 2. K/min; Tend: 240. C
CapillaryCP Sil 5 CB2047.Wells, Gillespie, et al., 1985120. C @ 1. min, 3. K/min; Column length: 25. m; Column diameter: 0.22 mm; Tend: 250. C

Normal alkane RI, non-polar column, custom temperature program

View large format table.

Column type Active phase I Reference Comment
CapillaryUltra-12046.Tameo and Kiyos, 1991Program: not specified
CapillaryOV-12072.Waggott and Davies, 1984Hydrogen; Column length: 50. m; Column diameter: 0.32 mm; Program: not specified
CapillaryOV-1, SE-30, Methyl silicone, SP-2100, OV-101, DB-1, etc.2072.Waggott and Davies, 1984Hydrogen; Column length: 50. m; Column diameter: 0.32 mm; Program: not specified
OtherMethyl Silicone2070.Ardrey and Moffat, 1981Program: not specified

Normal alkane RI, polar column, custom temperature program

View large format table.

Column type Active phase I Reference Comment
CapillaryCarbowax 20M2895.Tameo and Kiyos, 1991Program: not specified
CapillaryCarbowax 400, Carbowax 20M, Carbowax 1540, Carbowax 4000, Superox 06, PEG 20M, etc.2904.Waggott and Davies, 1984Hydrogen; Column length: 50. m; Column diameter: 0.32 mm; Program: not specified

References

Donnelly, Drewes, et al., 1990
Donnelly, J.R.; Drewes, L.A.; Johnson, R.L.; Munslow, W.D.; Knapp, K.K.; Sovocool, G.W.,
Purity and heat of fusion data for environmental standards as determined by differential scanning calorimetry,
Thermochim. Acta, 1990, 167, 2, 155, https://doi.org/10.1016/0040-6031(90)80476-F
. [all data]
Plato and Glasgow, 1969
Plato, C.; Glasgow, A.R., Jr.,
Differential scanning calorimetry as a general method for determining the purity and heat of fusion of high-purity organic chemicals. Application to 95 compounds,
Anal. Chem., 1969, 41, 2, 330, https://doi.org/10.1021/ac60271a041
. [all data]
Donnelly, Drewes, et al., 1990, 2
Donnelly, J.R.; Drewes, L.A.; Johnson, R.L.; Munslow, W.D.; Knapp, K.K.; Sovocool, G.W.,
Purity and heat of fusion data for environmental standards as determined by differential scanning calorimetry,
Thermochimica Acta, 1990, 167, 2, 155-187, https://doi.org/10.1016/0040-6031(90)80476-F
. [all data]