tris(2,2,6,6-tetramethylheptan-3,5-dionato)gallium(III)

Phase change data

Data compiled by: William E. Acree, Jr., James S. Chickos

Enthalpy of sublimation

ΔsubH (kJ/mol) Temperature (K) Method Reference
87.0413. - 443.TGAFahlman and Barron, 2000

References

Fahlman and Barron, 2000
Fahlman, Bradley D.; Barron, Andrew R., Substituent effects on the volatility of metal ?-diketonates, Adv. Mater. Opt. Electron., 2000, 10, 3-5, 223-232, https://doi.org/10.1002/1099-0712(200005/10)10:3/5<223::AID-AMO411>3.0.CO;2-M . [all data]