(Z)-4-hepten-2-ol
- Formula: C7H14O
- Molecular weight: 114.1855
- IUPAC Standard InChIKey: KZUFTCBJDQXWOJ-PLNGDYQASA-N
- CAS Registry Number: 34146-55-9
- Chemical structure:
View 3d structure (requires JavaScript / HTML 5) - Stereoisomers:
- Other names: 4-Hepten-2-ol, (Z)-; (Z)-hept-4-en-2-ol

Normal alkane RI, non-polar column, temperature ramp

Column type | Active phase | I | Reference | Comment |
---|---|---|---|---|
Capillary | DB-1 | 869. | Shiota, 1993 | 30. m/0.25 mm/0.25 μm, He, 50. C @ 3. min, 5. K/min; Tend: 240. C |
Capillary | DB-1 | 869. | Shiota, 1993 | 30. m/0.25 mm/0.25 μm, He, 50. C @ 3. min, 5. K/min; Tend: 240. C |
Capillary | DB-1 | 868. | Shiota, 1993 | 30. m/0.25 mm/0.25 μm, He, 50. C @ 5. min, 3. K/min; Tend: 240. C |
Capillary | DB-1 | 869. | Shiota, 1993 | 30. m/0.25 mm/0.25 μm, He, 50. C @ 5. min, 3. K/min; Tend: 240. C |

Normal alkane RI, polar column, temperature ramp

Column type | Active phase | I | Reference | Comment |
---|---|---|---|---|
Capillary | Carbowax 20M | 1310. | Buttery and Ling, 1984 | 60. C @ 40. min, 1. K/min; Column length: 150. m; Column diameter: 0.66 mm; Tend: 170. C |
Capillary | Carbowax 20M | 1310. | Buttery, Ling, et al., 1980 | 50. C @ 30. min, 1. K/min; Column length: 150. m; Column diameter: 0.64 mm; Tend: 170. C |

References

Shiota, 1993
Shiota, H.,
New esteric components in the volatiles of banana fruit (Musa sapientum L.),
J. Agric. Food Chem., 1993, 41, 11, 2056-2062, https://doi.org/10.1021/jf00035a046
. [all data]
Buttery and Ling, 1984
Buttery, R.G.; Ling, L.C.,
Corn leaf volatiles: identification using Tenax trapping for possible insect attractants,
J. Agric. Food Chem., 1984, 32, 5, 1104-1106, https://doi.org/10.1021/jf00125a044
. [all data]
Buttery, Ling, et al., 1980
Buttery, R.G.; Ling, L.C.; Teranishi, R.,
Volatile of corn tassels: possible corn ear worm attractants,
J. Agric. Food Chem., 1980, 28, 4, 771-774, https://doi.org/10.1021/jf60230a020
. [all data]