4-Hepten-3-one, 5-hydroxy-2,6-dimethyl-
- Formula: C9H16O2
- Molecular weight: 156.2221
- IUPAC Standard InChIKey: JIYKPNNTWHWONK-YVMONPNESA-N
- CAS Registry Number: 34136-02-2
- Chemical structure:
View 3d structure (requires JavaScript / HTML 5) - Permanent link for this species. Use this link for bookmarking this species for future reference.

Reaction thermochemistry data

Data compiled by: Hussein Y. Afeefy, Joel F. Liebman, and Stephen E. Stein
Individual Reactions
By formula: C9H16O2 = C9H16O2
Quantity | Value | Units | Method | Reference | Comment |
---|---|---|---|---|---|
ΔrH° | -15. ± 0.8 | kJ/mol | Eqk | Calmon, 1969 | liquid phase; NMR |

References

Calmon, 1969
Calmon, J.P.,
Thermodynamic functions of enolization of aliphatic β-diketones,
C. R. Acad. Sci. Paris, 1969, 268, 1435-1438. [all data]