Isoproturon
- Formula: C12H18N2O
- Molecular weight: 206.2841
- IUPAC Standard InChIKey: PUIYMUZLKQOUOZ-UHFFFAOYSA-N
- CAS Registry Number: 34123-59-6
- Chemical structure:
View 3d structure (requires JavaScript / HTML 5) - Other names: Urea, N,N-dimethyl-N'-[4-(1-methylethyl)phenyl]-; Urea, 1,1-dimethyl-3-(p-isopropylphenyl)-; Alon; Arelon; Belgran; CGA-18731; Graminon; HOE 16410; IP 50; N-(4-Isopropylphenyl)-N',N'-dimethylharnstoff; N-4-Isopropylphenyl-N,N-dimethylurea; N-(4-Isopropylphenyl)-N',N'-dimethylurea; Tolkan; Tolken; Protugan; N'-(4-Isopropylphenyl)-N,N-dimethylurea; 3-(4-Isopropylphenyl)-1,1-dimethylurea; Arelon R; CL 12150; DPX 6774; Hytane 500L; IP-Flo; IPU Stefes; Nocilon; Urea, 3-p-cumenyl-1,1-dimethyl-; N,N-dimethyl-N'-[4-(1-methylethyl)phenyl]urea

Phase change data

Data compiled as indicated in comments:
TRC - Thermodynamics Research Center, NIST Boulder Laboratories, Chris Muzny director
AC - William E. Acree, Jr., James S. Chickos
Quantity | Value | Units | Method | Reference | Comment |
---|---|---|---|---|---|
Tfus | 430.81 | K | N/A | Donnelly, Drewes, et al., 1990 | Uncertainty assigned by TRC = 0.2 K; TRC |
Enthalpy of fusion
ΔfusH (kJ/mol) | Temperature (K) | Method | Reference | Comment |
---|---|---|---|---|
21.33 | 427.4 | N/A | Yu, Tan, et al., 2003 | AC |
33.87 | 430.4 | DSC | Acree, 1991 | AC |

References

Donnelly, Drewes, et al., 1990
Donnelly, J.R.; Drewes, L.A.; Johnson, R.L.; Munslow, W.D.; Knapp, K.K.; Sovocool, G.W.,
Purity and heat of fusion data for environmental standards as determined by differential scanning calorimetry,
Thermochim. Acta, 1990, 167, 2, 155, https://doi.org/10.1016/0040-6031(90)80476-F
. [all data]
Yu, Tan, et al., 2003
Yu, P.; Tan, Z.C.; Meng, S.H.; Lu, S.W.; Lan, X.Z.; Sun, L.X.; Xu, F.; Zhang, T.; Hu, S.X.,
Low-temperature heat capacities and thermodynamic properties of crystalline isoproturon,
Journal of Thermal Analysis and Calorimetry, 2003, 74, 3, 867-874, https://doi.org/10.1023/B:JTAN.0000011018.14284.76
. [all data]
Acree, 1991
Acree, William E.,
Thermodynamic properties of organic compounds: enthalpy of fusion and melting point temperature compilation,
Thermochimica Acta, 1991, 189, 1, 37-56, https://doi.org/10.1016/0040-6031(91)87098-H
. [all data]