2-Hexene, 3,5-dimethyl-
- Formula: C8H16
- Molecular weight: 112.2126
- IUPAC Standard InChIKey: BQAZYKYBFAMHPG-UHFFFAOYSA-N
- CAS Registry Number: 3404-79-3
- Chemical structure:
View 3d structure (requires JavaScript / HTML 5) - Stereoisomers:

Kovats' RI, non-polar column, isothermal

Column type | Active phase | Temperature (C) | I | Reference | Comment |
---|---|---|---|---|---|
Capillary | Squalane | 100. | 750. | Mitra, Mohan, et al., 1974 | H2; Column length: 50. m; Column diameter: 0.2 mm |
Packed | Squalane | 30. | 751.5 | Tourres, 1967 | H2; Column length: 10. m |
Packed | Squalane | 50. | 752. | Tourres, 1967 | H2; Column length: 10. m |

References

Mitra, Mohan, et al., 1974
Mitra, G.D.; Mohan, G.; Sinha, A.,
Gas chromatographic analysis of complex hydrocarbon mixtures,
J. Chromatogr. A, 1974, 91, 633-648, https://doi.org/10.1016/S0021-9673(01)97944-0
. [all data]
Tourres, 1967
Tourres, D.A.,
Structural analysis of industrial butene dimers by gas chromatography,
J. Gas Chromatogr., 1967, 5, 1, 35-40, https://doi.org/10.1093/chromsci/5.1.35
. [all data]