2-Heptene, 3-methyl-
- Formula: C8H16
- Molecular weight: 112.2126
- IUPAC Standard InChIKey: OFKLSPUVNMOIJB-UHFFFAOYSA-N
- CAS Registry Number: 3404-75-9
- Chemical structure:
View 3d structure (requires JavaScript / HTML 5) - Stereoisomers:
- Other names: 3-Methylhept-2-ene; 3-Methyl-2-heptene

Phase change data

Data compiled by: Thermodynamics Research Center, NIST Boulder Laboratories, Chris Muzny director
Quantity | Value | Units | Method | Reference | Comment |
---|---|---|---|---|---|
Tboil | 394.65 | K | N/A | Obolentsev and Usov, 1947 | Uncertainty assigned by TRC = 2. K |
Tboil | 394.65 | K | N/A | Horney and Smittenberg, 1937 | Uncertainty assigned by TRC = 1.5 K |
Tboil | 395.65 | K | N/A | Hull, 1935 | Uncertainty assigned by TRC = 0.7 K |

References

Obolentsev and Usov, 1947
Obolentsev, R.D.; Usov, Yu.N.,
J. Gen. Chem. USSR (Engl. Transl.), 1947, 17, 897. [all data]
Horney and Smittenberg, 1937
Horney, A.G.; Smittenberg, J.,
Higher Type Olefins from Alkyl Substituted Bromoethylenes and Alkyl Halides by Means of Sodium or Magnesium and the Wurtz Reaction, Ph.D. Dissertation, Ohio State Univ., Columbus, 1937. [all data]
Hull, 1935
Hull, C.M.,
Synthesis of Olefins of Type IV, Ph.D. Dissertation, Ohio State Univ., Columbus, OH, 1935. [all data]