Hexane, 3-methyl-4-methylene-
- Formula: C8H16
- Molecular weight: 112.2126
- IUPAC Standard InChIKey: YXLCVBVDFKWWRW-UHFFFAOYSA-N
- CAS Registry Number: 3404-67-9
- Chemical structure:
View 3d structure (requires JavaScript / HTML 5) - Other names: 2-Ethyl-3-methyl-1-pentene; 1-Pentene, 2-ethyl-3-methyl; 2-Ethyl-3-methylpent-1-ene; 3-methyl-4-methylenehexane

Phase change data

Data compiled as indicated in comments:
TRC - Thermodynamics Research Center, NIST Boulder Laboratories, Chris Muzny director
AC - William E. Acree, Jr., James S. Chickos
Quantity | Value | Units | Method | Reference | Comment |
---|---|---|---|---|---|
Tboil | 384.9 | K | N/A | Mavity, 1931 | Uncertainty assigned by TRC = 2. K; TRC |
Quantity | Value | Units | Method | Reference | Comment |
ΔvapH° | 38.9 | kJ/mol | N/A | Reid, 1972 | AC |
Enthalpy of vaporization
ΔvapH (kJ/mol) | Temperature (K) | Method | Reference | Comment |
---|---|---|---|---|
36.4 | 322. | A | Stephenson and Malanowski, 1987 | Based on data from 307. to 389. K.; AC |
36.4 | 323. | MM | Camin and Rossini, 1960 | Based on data from 308. to 383. K.; AC |

References

Mavity, 1931
Mavity, J.M.,
, Ph.D. Thesis, Ohio State Univ., Columbus, OH, 1931. [all data]
Reid, 1972
Reid, Robert C.,
Handbook on vapor pressure and heats of vaporization of hydrocarbons and related compounds, R. C. Wilhort and B. J. Zwolinski, Texas A Research Foundation. College Station, Texas(1971). 329 pages.$10.00,
AIChE J., 1972, 18, 6, 1278-1278, https://doi.org/10.1002/aic.690180637
. [all data]
Stephenson and Malanowski, 1987
Stephenson, Richard M.; Malanowski, Stanislaw,
Handbook of the Thermodynamics of Organic Compounds, 1987, https://doi.org/10.1007/978-94-009-3173-2
. [all data]
Camin and Rossini, 1960
Camin, D.L.; Rossini, F.D.,
Physical Properties of 16 Selected C 7 and C 8 Alkene Hydrocarbons.,
J. Chem. Eng. Data, 1960, 5, 3, 368-372, https://doi.org/10.1021/je60007a037
. [all data]